{"text_format":"2","workbook":"xlsx","n_sheets":24,"sheets":["Menu","Import data","Imported selection","Data entry form","Actions","Actions summary","Unique code summary","Search","Selection","Space output","Nursery summary report","Stage 1","Stage 2","Stage 3","Stage 4","Stage 5","Stage 6","Stage 7","Stage 8","Stage 9","Final stage for sale","User guide","Nursery details","Contact us"],"not_rendered":{"charts":0,"images":104,"macros":1,"external_links":0,"defined_names":0,"comments":9,"pivot_tables":0},"unopened":[],"bounds":{"document_bytes":16777216,"sheet_cells":100000,"run_cost":"one","rows_first":2000,"rows_last":500,"rows_between":2000,"halvings":0,"cell_chars":16384,"cell_head_chars":4096},"cells_cut":0,"cells_raw":0,"read":"whole","date_system":"1900"}

{"sheet":"Menu","index":0,"n_rows":25,"n_cols":6,"rows_kept":25,"cut":false,"hidden":false,"merged":[]}
{"$rows_empty":14}
[null,null,"MENU"]
[]
[null,null,null,"?",null,"Data entry form"]
[]
[null,null,null,"?",null,"Import data from ProCost"]
[]
[null,null,null,"?",null,"User guide"]
[]
[null,null,null,"?",null,"Enter or change nursery details"]
[]
[null,null,null,"?",null,"Contact us"]

{"sheet":"Import data","index":1,"n_rows":59,"n_cols":100,"rows_kept":59,"cut":false,"hidden":false,"merged":[[20,10,20,12],[22,10,22,12],[18,10,18,12],[18,6,18,8],[6,6,6,8],[6,10,6,12],[8,10,8,12],[16,10,16,12],[12,10,12,12]]}
[{"$nulls":59},"DROP DOWN MENU PAGES",{"$nulls":4},"OVERWRITE CHOICE",{"$nulls":20},"CONTAINER DATA Entered on Data Entry Form",null,null,null,"?","SITE OR ENVIRONMENT TYPE",null,null,"?","AREAS WITHIN THE SITE",null,null,"?","ComboBox contents"]
[{"$nulls":6},"        Import data"]
[{"$nulls":9},"Go to"]
[{"$nulls":59},"Production stage",{"$nulls":4},"Choice",{"$nulls":20},"Pot or tray types","Product units",null,null,null,"Main area names",null,null,null,"Name",null,null,null,"Name","Selection"]
[{"$nulls":85},"No selection",{"$f":"IF('Data entry form'!CH5<>0,'Data entry form'!CH5,\"\")","v":""},null,null,null,"No selection",null,null,null,"No selection",null,null,null,1,"No selection"]
[{"$nulls":59},"Data entry form",{"$nulls":4},"Yes",{"$nulls":20},{"$f":"IF('Data entry form'!CG6<>\"\",'Data entry form'!CG6,\"\")","v":""},{"$f":"IF('Data entry form'!CH6<>0,'Data entry form'!CH6,\"\")","v":""},null,null,null,{"$f":"IF('Data entry form'!BU6<>\"\",'Data entry form'!BU6,\"\")","v":""},{"$nulls":7},3,"No selection"]
[null,null,"?",null,"ProCost filename (name.xls or .xlsm)",{"$nulls":5},{"$f":"IF(G7=\"\",\"Error: Enter ProCost file name\",\"Okay\")","v":"Error: Enter ProCost file name"},{"$nulls":48},"Search",{"$nulls":4},"No",{"$nulls":20},{"$f":"IF('Data entry form'!CG7<>\"\",'Data entry form'!CG7,\"\")","v":""},{"$f":"IF('Data entry form'!CH7<>0,'Data entry form'!CH7,\"\")","v":""},null,null,null,{"$f":"IF('Data entry form'!BU7<>\"\",'Data entry form'!BU7,\"\")","v":""},{"$nulls":7},4,"No selection"]
[{"$nulls":59},"Selection",{"$nulls":25},{"$f":"IF('Data entry form'!CG8<>\"\",'Data entry form'!CG8,\"\")","v":""},{"$f":"IF('Data entry form'!CH8<>0,'Data entry form'!CH8,\"\")","v":""},null,null,null,{"$f":"IF('Data entry form'!BU8<>\"\",'Data entry form'!BU8,\"\")","v":""}]
[null,null,"?",null,"Start period (dd/mm/yyyy):  From",null,null,"to",null,null,{"$f":"IF(AND(G9=\"\",I9=\"\"),\"Consider entering search dates?\",IF(G9=\"\",\"Consider entering a start date?\",IF(I9=\"\",\"Consider entering an end date?\",\"Okay\")))","v":"Consider entering search dates?"},{"$nulls":48},"Actions",{"$nulls":25},{"$f":"IF('Data entry form'!CG9<>\"\",'Data entry form'!CG9,\"\")","v":""},{"$f":"IF('Data entry form'!CH9<>0,'Data entry form'!CH9,\"\")","v":""},null,null,null,{"$f":"IF('Data entry form'!BU9<>\"\",'Data entry form'!BU9,\"\")","v":""}]
[{"$nulls":59},"Actions summary",{"$nulls":25},{"$f":"IF('Data entry form'!CG10<>\"\",'Data entry form'!CG10,\"\")","v":""},{"$f":"IF('Data entry form'!CH10<>0,'Data entry form'!CH10,\"\")","v":""},null,null,null,{"$f":"IF('Data entry form'!BU10<>\"\",'Data entry form'!BU10,\"\")","v":""}]
[null,null,"?",{"$nulls":56},"Unique code summary",{"$nulls":25},{"$f":"IF('Data entry form'!CG11<>\"\",'Data entry form'!CG11,\"\")","v":""},{"$f":"IF('Data entry form'!CH11<>0,'Data entry form'!CH11,\"\")","v":""},null,null,null,{"$f":"IF('Data entry form'!BU11<>\"\",'Data entry form'!BU11,\"\")","v":""}]
[{"$nulls":59},"Import data",{"$nulls":25},{"$f":"IF('Data entry form'!CG12<>\"\",'Data entry form'!CG12,\"\")","v":""},{"$f":"IF('Data entry form'!CH12<>0,'Data entry form'!CH12,\"\")","v":""},null,null,null,{"$f":"IF('Data entry form'!BU12<>\"\",'Data entry form'!BU12,\"\")","v":""}]
[null,null,"?",null,"End period (dd/mm/yyyy):   From",null,null,"to",null,null,{"$f":"IF(AND(G13=\"\",I13=\"\"),\"Consider entering search dates?\",IF(G13=\"\",\"Consider entering a start date?\",IF(I13=\"\",\"Consider entering an end date?\",\"Okay\")))","v":"Consider entering search dates?"},{"$nulls":48},"Imported selection",{"$nulls":25},{"$f":"IF('Data entry form'!CG13<>\"\",'Data entry form'!CG13,\"\")","v":""},{"$f":"IF('Data entry form'!CH13<>0,'Data entry form'!CH13,\"\")","v":""},null,null,null,{"$f":"IF('Data entry form'!BU13<>\"\",'Data entry form'!BU13,\"\")","v":""}]
[{"$nulls":59},"Space output",{"$nulls":25},{"$f":"IF('Data entry form'!CG14<>\"\",'Data entry form'!CG14,\"\")","v":""},{"$f":"IF('Data entry form'!CH14<>0,'Data entry form'!CH14,\"\")","v":""},null,null,null,{"$f":"IF('Data entry form'!BU14<>\"\",'Data entry form'!BU14,\"\")","v":""}]
[null,null,"?",{"$nulls":56},"Nursery summary report",{"$nulls":25},{"$f":"IF('Data entry form'!CG15<>\"\",'Data entry form'!CG15,\"\")","v":""},{"$f":"IF('Data entry form'!CH15<>0,'Data entry form'!CH15,\"\")","v":""},null,null,null,{"$f":"IF('Data entry form'!BU15<>\"\",'Data entry form'!BU15,\"\")","v":""}]
[{"$nulls":59},"Stage 1",{"$nulls":25},{"$f":"IF('Data entry form'!CG16<>\"\",'Data entry form'!CG16,\"\")","v":""},{"$f":"IF('Data entry form'!CH16<>0,'Data entry form'!CH16,\"\")","v":""},null,null,null,{"$f":"IF('Data entry form'!BU16<>\"\",'Data entry form'!BU16,\"\")","v":""}]
[null,null,"?",null,"Enter container type",{"$nulls":5},{"$f":"IF(CV5=\"No selection\",\"Consider entering a container type?\",\"Okay\")","v":"Consider entering a container type?"},{"$nulls":48},"Final stage for sale",{"$nulls":25},{"$f":"IF('Data entry form'!CG17<>\"\",'Data entry form'!CG17,\"\")","v":""},{"$f":"IF('Data entry form'!CH17<>0,'Data entry form'!CH17,\"\")","v":""},null,null,null,{"$f":"IF('Data entry form'!BU17<>\"\",'Data entry form'!BU17,\"\")","v":""}]
[{"$nulls":59},"Stage 2",{"$nulls":25},{"$f":"IF('Data entry form'!CG18<>\"\",'Data entry form'!CG18,\"\")","v":""},{"$f":"IF('Data entry form'!CH18<>0,'Data entry form'!CH18,\"\")","v":""},null,null,null,{"$f":"IF('Data entry form'!BU18<>\"\",'Data entry form'!BU18,\"\")","v":""}]
[null,null,"?",null,"Enter at least 3 letters of the name",{"$nulls":5},{"$f":"IF(G19=\"\",\"Search will include all variety names\",\"Okay\")","v":"Search will include all variety names"},{"$nulls":48},"Stage 3",{"$nulls":25},{"$f":"IF('Data entry form'!CG19<>\"\",'Data entry form'!CG19,\"\")","v":""},{"$f":"IF('Data entry form'!CH19<>0,'Data entry form'!CH19,\"\")","v":""},null,null,null,{"$f":"IF('Data entry form'!BU19<>\"\",'Data entry form'!BU19,\"\")","v":""}]
[{"$nulls":59},"Stage 4",{"$nulls":25},{"$f":"IF('Data entry form'!CG20<>\"\",'Data entry form'!CG20,\"\")","v":""},{"$f":"IF('Data entry form'!CH20<>0,'Data entry form'!CH20,\"\")","v":""},null,null,null,{"$f":"IF('Data entry form'!BU20<>\"\",'Data entry form'!BU20,\"\")","v":""}]
[null,null,"?",null,"Location site or environment type",{"$nulls":5},{"$f":"IF(CV6=\"No selection\",\"Search will include all sites\",\"Okay\")","v":"Search will include all sites"},{"$nulls":48},"Stage 5",{"$nulls":25},{"$f":"IF('Data entry form'!CG21<>\"\",'Data entry form'!CG21,\"\")","v":""},{"$f":"IF('Data entry form'!CH21<>0,'Data entry form'!CH21,\"\")","v":""},null,null,null,{"$f":"IF('Data entry form'!BU21<>\"\",'Data entry form'!BU21,\"\")","v":""}]
[{"$nulls":59},"Stage 6",{"$nulls":25},{"$f":"IF('Data entry form'!CG22<>\"\",'Data entry form'!CG22,\"\")","v":""},{"$f":"IF('Data entry form'!CH22<>0,'Data entry form'!CH22,\"\")","v":""},null,null,null,{"$f":"IF('Data entry form'!BU22<>\"\",'Data entry form'!BU22,\"\")","v":""}]
[null,null,"?",null,"Area name or code",{"$nulls":5},{"$f":"IF(CV7=\"No selection\",\"Search will include all areas\",\"Okay\")","v":"Search will include all areas"},{"$nulls":48},"Stage 7",{"$nulls":25},{"$f":"IF('Data entry form'!CG23<>\"\",'Data entry form'!CG23,\"\")","v":""},{"$f":"IF('Data entry form'!CH23<>0,'Data entry form'!CH23,\"\")","v":""},null,null,null,{"$f":"IF('Data entry form'!BU23<>\"\",'Data entry form'!BU23,\"\")","v":""}]
[{"$nulls":59},"Stage 8",{"$nulls":25},{"$f":"IF('Data entry form'!CG24<>\"\",'Data entry form'!CG24,\"\")","v":""},{"$f":"IF('Data entry form'!CH24<>0,'Data entry form'!CH24,\"\")","v":""},null,null,null,{"$f":"IF('Data entry form'!BU24<>\"\",'Data entry form'!BU24,\"\")","v":""}]
[{"$nulls":59},"Stage 9",{"$nulls":25},{"$f":"IF('Data entry form'!CG25<>\"\",'Data entry form'!CG25,\"\")","v":""},{"$f":"IF('Data entry form'!CH25<>0,'Data entry form'!CH25,\"\")","v":""},null,null,null,{"$f":"IF('Data entry form'!BU25<>\"\",'Data entry form'!BU25,\"\")","v":""}]
[{"$nulls":59},"Menu",{"$nulls":25},{"$f":"IF('Data entry form'!CG26<>\"\",'Data entry form'!CG26,\"\")","v":""},{"$f":"IF('Data entry form'!CH26<>0,'Data entry form'!CH26,\"\")","v":""},null,null,null,{"$f":"IF('Data entry form'!BU26<>\"\",'Data entry form'!BU26,\"\")","v":""}]
[{"$nulls":59},"User guide",{"$nulls":25},{"$f":"IF('Data entry form'!CG27<>\"\",'Data entry form'!CG27,\"\")","v":""},{"$f":"IF('Data entry form'!CH27<>0,'Data entry form'!CH27,\"\")","v":""},null,null,null,{"$f":"IF('Data entry form'!BU27<>\"\",'Data entry form'!BU27,\"\")","v":""}]
[{"$nulls":59},"Contact us",{"$nulls":25},{"$f":"IF('Data entry form'!CG28<>\"\",'Data entry form'!CG28,\"\")","v":""},{"$f":"IF('Data entry form'!CH28<>0,'Data entry form'!CH28,\"\")","v":""},null,null,null,{"$f":"IF('Data entry form'!BU28<>\"\",'Data entry form'!BU28,\"\")","v":""}]
[{"$nulls":59},"Nursery details",{"$nulls":25},{"$f":"IF('Data entry form'!CG29<>\"\",'Data entry form'!CG29,\"\")","v":""},{"$f":"IF('Data entry form'!CH29<>0,'Data entry form'!CH29,\"\")","v":""},null,null,null,{"$f":"IF('Data entry form'!BU29<>\"\",'Data entry form'!BU29,\"\")","v":""}]
[{"$nulls":85},{"$f":"IF('Data entry form'!CG30<>\"\",'Data entry form'!CG30,\"\")","v":""},{"$f":"IF('Data entry form'!CH30<>0,'Data entry form'!CH30,\"\")","v":""},null,null,null,{"$f":"IF('Data entry form'!BU30<>\"\",'Data entry form'!BU30,\"\")","v":""}]
[{"$nulls":85},{"$f":"IF('Data entry form'!CG31<>\"\",'Data entry form'!CG31,\"\")","v":""},{"$f":"IF('Data entry form'!CH31<>0,'Data entry form'!CH31,\"\")","v":""},null,null,null,{"$f":"IF('Data entry form'!BU31<>\"\",'Data entry form'!BU31,\"\")","v":""}]
[{"$nulls":85},{"$f":"IF('Data entry form'!CG32<>\"\",'Data entry form'!CG32,\"\")","v":""},{"$f":"IF('Data entry form'!CH32<>0,'Data entry form'!CH32,\"\")","v":""},null,null,null,{"$f":"IF('Data entry form'!BU32<>\"\",'Data entry form'!BU32,\"\")","v":""}]
[{"$nulls":85},{"$f":"IF('Data entry form'!CG33<>\"\",'Data entry form'!CG33,\"\")","v":""},{"$f":"IF('Data entry form'!CH33<>0,'Data entry form'!CH33,\"\")","v":""},null,null,null,{"$f":"IF('Data entry form'!BU33<>\"\",'Data entry form'!BU33,\"\")","v":""}]
[{"$nulls":85},{"$f":"IF('Data entry form'!CG34<>\"\",'Data entry form'!CG34,\"\")","v":""},{"$f":"IF('Data entry form'!CH34<>0,'Data entry form'!CH34,\"\")","v":""},null,null,null,{"$f":"IF('Data entry form'!BU34<>\"\",'Data entry form'!BU34,\"\")","v":""}]
[{"$nulls":85},{"$f":"IF('Data entry form'!CG35<>\"\",'Data entry form'!CG35,\"\")","v":""},{"$f":"IF('Data entry form'!CH35<>0,'Data entry form'!CH35,\"\")","v":""},null,null,null,{"$f":"IF('Data entry form'!BU35<>\"\",'Data entry form'!BU35,\"\")","v":""}]
[{"$nulls":85},{"$f":"IF('Data entry form'!CG36<>\"\",'Data entry form'!CG36,\"\")","v":""},{"$f":"IF('Data entry form'!CH36<>0,'Data entry form'!CH36,\"\")","v":""},null,null,null,{"$f":"IF('Data entry form'!BU36<>\"\",'Data entry form'!BU36,\"\")","v":""}]
[{"$nulls":85},{"$f":"IF('Data entry form'!CG39<>\"\",'Data entry form'!CG39,\"\")","v":""},{"$f":"IF('Data entry form'!CH39<>0,'Data entry form'!CH39,\"\")","v":""},null,null,null,{"$f":"IF('Data entry form'!BU39<>\"\",'Data entry form'!BU39,\"\")","v":""}]
[{"$nulls":85},{"$f":"IF('Data entry form'!CG40<>\"\",'Data entry form'!CG40,\"\")","v":""},{"$f":"IF('Data entry form'!CH40<>0,'Data entry form'!CH40,\"\")","v":""},null,null,null,{"$f":"IF('Data entry form'!BU40<>\"\",'Data entry form'!BU40,\"\")","v":""}]
[{"$nulls":85},{"$f":"IF('Data entry form'!CG41<>\"\",'Data entry form'!CG41,\"\")","v":""},{"$f":"IF('Data entry form'!CH41<>0,'Data entry form'!CH41,\"\")","v":""},null,null,null,{"$f":"IF('Data entry form'!BU41<>\"\",'Data entry form'!BU41,\"\")","v":""}]
[{"$nulls":85},{"$f":"IF('Data entry form'!CG42<>\"\",'Data entry form'!CG42,\"\")","v":""},{"$f":"IF('Data entry form'!CH42<>0,'Data entry form'!CH42,\"\")","v":""},null,null,null,{"$f":"IF('Data entry form'!BU42<>\"\",'Data entry form'!BU42,\"\")","v":""}]
[{"$nulls":85},{"$f":"IF('Data entry form'!CG43<>\"\",'Data entry form'!CG43,\"\")","v":""},{"$f":"IF('Data entry form'!CH43<>0,'Data entry form'!CH43,\"\")","v":""},null,null,null,{"$f":"IF('Data entry form'!BU43<>\"\",'Data entry form'!BU43,\"\")","v":""}]
[{"$nulls":85},{"$f":"IF('Data entry form'!CG44<>\"\",'Data entry form'!CG44,\"\")","v":""},{"$f":"IF('Data entry form'!CH44<>0,'Data entry form'!CH44,\"\")","v":""},null,null,null,{"$f":"IF('Data entry form'!BU44<>\"\",'Data entry form'!BU44,\"\")","v":""}]
[{"$nulls":85},{"$f":"IF('Data entry form'!CG45<>\"\",'Data entry form'!CG45,\"\")","v":""},{"$f":"IF('Data entry form'!CH45<>0,'Data entry form'!CH45,\"\")","v":""},null,null,null,{"$f":"IF('Data entry form'!BU45<>\"\",'Data entry form'!BU45,\"\")","v":""}]
[{"$nulls":85},{"$f":"IF('Data entry form'!CG46<>\"\",'Data entry form'!CG46,\"\")","v":""},{"$f":"IF('Data entry form'!CH46<>0,'Data entry form'!CH46,\"\")","v":""},null,null,null,{"$f":"IF('Data entry form'!BU46<>\"\",'Data entry form'!BU46,\"\")","v":""}]
[{"$nulls":85},{"$f":"IF('Data entry form'!CG47<>\"\",'Data entry form'!CG47,\"\")","v":""},{"$f":"IF('Data entry form'!CH47<>0,'Data entry form'!CH47,\"\")","v":""},null,null,null,{"$f":"IF('Data entry form'!BU47<>\"\",'Data entry form'!BU47,\"\")","v":""}]
[{"$nulls":85},{"$f":"IF('Data entry form'!CG48<>\"\",'Data entry form'!CG48,\"\")","v":""},{"$f":"IF('Data entry form'!CH48<>0,'Data entry form'!CH48,\"\")","v":""},null,null,null,{"$f":"IF('Data entry form'!BU48<>\"\",'Data entry form'!BU48,\"\")","v":""}]
[{"$nulls":85},{"$f":"IF('Data entry form'!CG49<>\"\",'Data entry form'!CG49,\"\")","v":""},{"$f":"IF('Data entry form'!CH49<>0,'Data entry form'!CH49,\"\")","v":""},null,null,null,{"$f":"IF('Data entry form'!BU49<>\"\",'Data entry form'!BU49,\"\")","v":""}]
[{"$nulls":85},{"$f":"IF('Data entry form'!CG50<>\"\",'Data entry form'!CG50,\"\")","v":""},{"$f":"IF('Data entry form'!CH50<>0,'Data entry form'!CH50,\"\")","v":""},null,null,null,{"$f":"IF('Data entry form'!BU50<>\"\",'Data entry form'!BU50,\"\")","v":""}]
[{"$nulls":85},{"$f":"IF('Data entry form'!CG51<>\"\",'Data entry form'!CG51,\"\")","v":""},{"$f":"IF('Data entry form'!CH51<>0,'Data entry form'!CH51,\"\")","v":""},null,null,null,{"$f":"IF('Data entry form'!BU51<>\"\",'Data entry form'!BU51,\"\")","v":""}]
[{"$nulls":85},{"$f":"IF('Data entry form'!CG52<>\"\",'Data entry form'!CG52,\"\")","v":""},{"$f":"IF('Data entry form'!CH52<>0,'Data entry form'!CH52,\"\")","v":""},null,null,null,{"$f":"IF('Data entry form'!BU52<>\"\",'Data entry form'!BU52,\"\")","v":""}]
[{"$nulls":85},{"$f":"IF('Data entry form'!CG53<>\"\",'Data entry form'!CG53,\"\")","v":""},{"$f":"IF('Data entry form'!CH53<>0,'Data entry form'!CH53,\"\")","v":""},null,null,null,{"$f":"IF('Data entry form'!BU53<>\"\",'Data entry form'!BU53,\"\")","v":""}]
[{"$nulls":85},{"$f":"IF('Data entry form'!CG54<>\"\",'Data entry form'!CG54,\"\")","v":""},{"$f":"IF('Data entry form'!CH54<>0,'Data entry form'!CH54,\"\")","v":""},null,null,null,{"$f":"IF('Data entry form'!BU54<>\"\",'Data entry form'!BU54,\"\")","v":""}]
[{"$nulls":85},{"$f":"IF('Data entry form'!CG55<>\"\",'Data entry form'!CG55,\"\")","v":""},{"$f":"IF('Data entry form'!CH55<>0,'Data entry form'!CH55,\"\")","v":""},null,null,null,{"$f":"IF('Data entry form'!BU55<>\"\",'Data entry form'!BU55,\"\")","v":""}]
[{"$nulls":85},{"$f":"IF('Data entry form'!CG56<>\"\",'Data entry form'!CG56,\"\")","v":""},{"$f":"IF('Data entry form'!CH56<>0,'Data entry form'!CH56,\"\")","v":""},null,null,null,{"$f":"IF('Data entry form'!BU56<>\"\",'Data entry form'!BU56,\"\")","v":""}]
[{"$nulls":85},{"$f":"IF('Data entry form'!CG57<>\"\",'Data entry form'!CG57,\"\")","v":""},{"$f":"IF('Data entry form'!CH57<>0,'Data entry form'!CH57,\"\")","v":""},null,null,null,{"$f":"IF('Data entry form'!BU57<>\"\",'Data entry form'!BU57,\"\")","v":""}]
[{"$nulls":85},{"$f":"IF('Data entry form'!CG58<>\"\",'Data entry form'!CG58,\"\")","v":""},{"$f":"IF('Data entry form'!CH58<>0,'Data entry form'!CH58,\"\")","v":""},null,null,null,{"$f":"IF('Data entry form'!BU58<>\"\",'Data entry form'!BU58,\"\")","v":""}]
[{"$nulls":85},{"$f":"IF('Data entry form'!CG59<>\"\",'Data entry form'!CG59,\"\")","v":""},{"$f":"IF('Data entry form'!CH59<>0,'Data entry form'!CH59,\"\")","v":""},null,null,null,{"$f":"IF('Data entry form'!BU59<>\"\",'Data entry form'!BU59,\"\")","v":""}]
[{"$nulls":90},{"$f":"IF('Data entry form'!BU60<>\"\",'Data entry form'!BU60,\"\")","v":""}]
[{"$nulls":90},{"$f":"IF('Data entry form'!BU61<>\"\",'Data entry form'!BU61,\"\")","v":""}]

{"sheet":"Imported selection","index":2,"n_rows":514,"n_cols":60,"rows_kept":514,"cut":false,"hidden":false,"merged":[[509,4,509,5],[509,6,509,7],[509,10,509,12],[510,4,510,5],[510,6,510,7],[510,10,510,12],[513,4,513,5],[513,6,513,7],[513,10,513,12],[511,4,511,5],[511,6,511,7],[511,10,511,12],[512,4,512,5],[512,6,512,7],[512,10,512,12],[503,4,503,5],[503,6,503,7],[503,10,503,12],[504,4,504,5],[504,6,504,7],[504,10,504,12],[505,4,505,5],[505,6,505,7],[505,10,505,12],[506,4,506,5],[506,6,506,7],[506,10,506,12],[507,4,507,5],[507,6,507,7],[507,10,507,12],[508,4,508,5],[508,6,508,7],[508,10,508,12],[497,4,497,5],[497,6,497,7],[497,10,497,12],[498,4,498,5],[498,6,498,7],[498,10,498,12],[499,4,499,5],[499,6,499,7],[499,10,499,12],[500,4,500,5],[500,6,500,7],[500,10,500,12],[501,4,501,5],[501,6,501,7],[501,10,501,12],[502,4,502,5],[502,6,502,7],[502,10,502,12],[491,4,491,5],[491,6,491,7],[491,10,491,12],[492,4,492,5],[492,6,492,7],[492,10,492,12],[493,4,493,5],[493,6,493,7],[493,10,493,12],[494,4,494,5],[494,6,494,7],[494,10,494,12],[495,4,495,5],[495,6,495,7],[495,10,495,12],[496,4,496,5],[496,6,496,7],[496,10,496,12],[485,4,485,5],[485,6,485,7],[485,10,485,12],[486,4,486,5],[486,6,486,7],[486,10,486,12],[487,4,487,5],[487,6,487,7],[487,10,487,12],[488,4,488,5],[488,6,488,7],[488,10,488,12],[489,4,489,5],[489,6,489,7],[489,10,489,12],[490,4,490,5],[490,6,490,7],[490,10,490,12],[479,4,479,5],[479,6,479,7],[479,10,479,12],[480,4,480,5],[480,6,480,7],[480,10,480,12],[481,4,481,5],[481,6,481,7],[481,10,481,12],[482,4,482,5],[482,6,482,7],[482,10,482,12],[483,4,483,5],[483,6,483,7],[483,10,483,12],[484,4,484,5],[484,6,484,7],[484,10,484,12],[473,4,473,5],[473,6,473,7],[473,10,473,12],[474,4,474,5],[474,6,474,7],[474,10,474,12],[475,4,475,5],[475,6,475,7],[475,10,475,12],[476,4,476,5],[476,6,476,7],[476,10,476,12],[477,4,477,5],[477,6,477,7],[477,10,477,12],[478,4,478,5],[478,6,478,7],[478,10,478,12],[467,4,467,5],[467,6,467,7],[467,10,467,12],[468,4,468,5],[468,6,468,7],[468,10,468,12],[469,4,469,5],[469,6,469,7],[469,10,469,12],[470,4,470,5],[470,6,470,7],[470,10,470,12],[471,4,471,5],[471,6,471,7],[471,10,471,12],[472,4,472,5],[472,6,472,7],[472,10,472,12],[461,4,461,5],[461,6,461,7],[461,10,461,12],[462,4,462,5],[462,6,462,7],[462,10,462,12],[463,4,463,5],[463,6,463,7],[463,10,463,12],[464,4,464,5],[464,6,464,7],[464,10,464,12],[465,4,465,5],[465,6,465,7],[465,10,465,12],[466,4,466,5],[466,6,466,7],[466,10,466,12],[455,4,455,5],[455,6,455,7],[455,10,455,12],[456,4,456,5],[456,6,456,7],[456,10,456,12],[457,4,457,5],[457,6,457,7],[457,10,457,12],[458,4,458,5],[458,6,458,7],[458,10,458,12],[459,4,459,5],[459,6,459,7],[459,10,459,12],[460,4,460,5],[460,6,460,7],[460,10,460,12],[449,4,449,5],[449,6,449,7],[449,10,449,12],[450,4,450,5],[450,6,450,7],[450,10,450,12],[451,4,451,5],[451,6,451,7],[451,10,451,12],[452,4,452,5],[452,6,452,7],[452,10,452,12],[453,4,453,5],[453,6,453,7],[453,10,453,12],[454,4,454,5],[454,6,454,7],[454,10,454,12],[443,4,443,5],[443,6,443,7],[443,10,443,12],[444,4,444,5],[444,6,444,7],[444,10,444,12],[445,4,445,5],[445,6,445,7],[445,10,445,12],[446,4,446,5],[446,6,446,7],[446,10,446,12],[447,4,447,5],[447,6,447,7],[447,10,447,12],[448,4,448,5],[448,6,448,7],[448,10,448,12],[437,4,437,5],[437,6,437,7],[437,10,437,12],[438,4,438,5],[438,6,438,7],[438,10,438,12],[439,4,439,5],[439,6,439,7],[439,10,439,12],[440,4,440,5],[440,6,440,7],[440,10,440,12],[441,4,441,5],[441,6,441,7],[441,10,441,12],[442,4,442,5],[442,6,442,7],[442,10,442,12],[431,4,431,5],[431,6,431,7],[431,10,431,12],[432,4,432,5],[432,6,432,7],[432,10,432,12],[433,4,433,5],[433,6,433,7],[433,10,433,12],[434,4,434,5],[434,6,434,7],[434,10,434,12],[435,4,435,5],[435,6,435,7],[435,10,435,12],[436,4,436,5],[436,6,436,7],[436,10,436,12],[425,4,425,5],[425,6,425,7],[425,10,425,12],[426,4,426,5],[426,6,426,7],[426,10,426,12],[427,4,427,5],[427,6,427,7],[427,10,427,12],[428,4,428,5],[428,6,428,7],[428,10,428,12],[429,4,429,5],[429,6,429,7],[429,10,429,12],[430,4,430,5],[430,6,430,7],[430,10,430,12],[419,4,419,5],[419,6,419,7],[419,10,419,12],[420,4,420,5],[420,6,420,7],[420,10,420,12],[421,4,421,5],[421,6,421,7],[421,10,421,12],[422,4,422,5],[422,6,422,7],[422,10,422,12],[423,4,423,5],[423,6,423,7],[423,10,423,12],[424,4,424,5],[424,6,424,7],[424,10,424,12],[413,4,413,5],[413,6,413,7],[413,10,413,12],[414,4,414,5],[414,6,414,7],[414,10,414,12],[415,4,415,5],[415,6,415,7],[415,10,415,12],[416,4,416,5],[416,6,416,7],[416,10,416,12],[417,4,417,5],[417,6,417,7],[417,10,417,12],[418,4,418,5],[418,6,418,7],[418,10,418,12],[407,4,407,5],[407,6,407,7],[407,10,407,12],[408,4,408,5],[408,6,408,7],[408,10,408,12],[409,4,409,5],[409,6,409,7],[409,10,409,12],[410,4,410,5],[410,6,410,7],[410,10,410,12],[411,4,411,5],[411,6,411,7],[411,10,411,12],[412,4,412,5],[412,6,412,7],[412,10,412,12],[401,4,401,5],[401,6,401,7],[401,10,401,12],[402,4,402,5],[402,6,402,7],[402,10,402,12],[403,4,403,5],[403,6,403,7],[403,10,403,12],[404,4,404,5],[404,6,404,7],[404,10,404,12],[405,4,405,5],[405,6,405,7],[405,10,405,12],[406,4,406,5],[406,6,406,7],[406,10,406,12],[395,4,395,5],[395,6,395,7],[395,10,395,12],[396,4,396,5],[396,6,396,7],[396,10,396,12],[397,4,397,5],[397,6,397,7],[397,10,397,12],[398,4,398,5],[398,6,398,7],[398,10,398,12],[399,4,399,5],[399,6,399,7],[399,10,399,12],[400,4,400,5],[400,6,400,7],[400,10,400,12],[389,4,389,5],[389,6,389,7],[389,10,389,12],[390,4,390,5],[390,6,390,7],[390,10,390,12],[391,4,391,5],[391,6,391,7],[391,10,391,12],[392,4,392,5],[392,6,392,7],[392,10,392,12],[393,4,393,5],[393,6,393,7],[393,10,393,12],[394,4,394,5],[394,6,394,7],[394,10,394,12],[383,4,383,5],[383,6,383,7],[383,10,383,12],[384,4,384,5],[384,6,384,7],[384,10,384,12],[385,4,385,5],[385,6,385,7],[385,10,385,12],[386,4,386,5],[386,6,386,7],[386,10,386,12],[387,4,387,5],[387,6,387,7],[387,10,387,12],[388,4,388,5],[388,6,388,7],[388,10,388,12],[377,4,377,5],[377,6,377,7],[377,10,377,12],[378,4,378,5],[378,6,378,7],[378,10,378,12],[379,4,379,5],[379,6,379,7],[379,10,379,12],[380,4,380,5],[380,6,380,7],[380,10,380,12],[381,4,381,5],[381,6,381,7],[381,10,381,12],[382,4,382,5],[382,6,382,7],[382,10,382,12],[371,4,371,5],[371,6,371,7],[371,10,371,12],[372,4,372,5],[372,6,372,7],[372,10,372,12],[373,4,373,5],[373,6,373,7],[373,10,373,12],[374,4,374,5],[374,6,374,7],[374,10,374,12],[375,4,375,5],[375,6,375,7],[375,10,375,12],[376,4,376,5],[376,6,376,7],[376,10,376,12],[365,4,365,5],[365,6,365,7],[365,10,365,12],[366,4,366,5],[366,6,366,7],[366,10,366,12],[367,4,367,5],[367,6,367,7],[367,10,367,12],[368,4,368,5],[368,6,368,7],[368,10,368,12],[369,4,369,5],[369,6,369,7],[369,10,369,12],[370,4,370,5],[370,6,370,7],[370,10,370,12],[359,4,359,5],[359,6,359,7],[359,10,359,12],[360,4,360,5],[360,6,360,7],[360,10,360,12],[361,4,361,5],[361,6,361,7],[361,10,361,12],[362,4,362,5],[362,6,362,7],[362,10,362,12],[363,4,363,5],[363,6,363,7],[363,10,363,12],[364,4,364,5],[364,6,364,7],[364,10,364,12],[353,4,353,5],[353,6,353,7],[353,10,353,12],[354,4,354,5],[354,6,354,7],[354,10,354,12],[355,4,355,5],[355,6,355,7],[355,10,355,12],[356,4,356,5],[356,6,356,7],[356,10,356,12],[357,4,357,5],[357,6,357,7],[357,10,357,12],[358,4,358,5],[358,6,358,7],[358,10,358,12],[347,4,347,5],[347,6,347,7],[347,10,347,12],[348,4,348,5],[348,6,348,7],[348,10,348,12],[349,4,349,5],[349,6,349,7],[349,10,349,12],[350,4,350,5],[350,6,350,7],[350,10,350,12],[351,4,351,5],[351,6,351,7],[351,10,351,12],[352,4,352,5],[352,6,352,7],[352,10,352,12],[341,4,341,5],[341,6,341,7],[341,10,341,12],[342,4,342,5],[342,6,342,7],[342,10,342,12],[343,4,343,5],[343,6,343,7],[343,10,343,12],[344,4,344,5],[344,6,344,7],[344,10,344,12],[345,4,345,5],[345,6,345,7],[345,10,345,12],[346,4,346,5],[346,6,346,7],[346,10,346,12],[335,4,335,5],[335,6,335,7],[335,10,335,12],[336,4,336,5],[336,6,336,7],[336,10,336,12],[337,4,337,5],[337,6,337,7],[337,10,337,12],[338,4,338,5],[338,6,338,7],[338,10,338,12],[339,4,339,5],[339,6,339,7],[339,10,339,12],[340,4,340,5],[340,6,340,7],[340,10,340,12],[329,4,329,5],[329,6,329,7],[329,10,329,12],[330,4,330,5],[330,6,330,7],[330,10,330,12],[331,4,331,5],[331,6,331,7],[331,10,331,12],[332,4,332,5],[332,6,332,7],[332,10,332,12],[333,4,333,5],[333,6,333,7],[333,10,333,12],[334,4,334,5],[334,6,334,7],[334,10,334,12],[323,4,323,5],[323,6,323,7],[323,10,323,12],[324,4,324,5],[324,6,324,7],[324,10,324,12],[325,4,325,5],[325,6,325,7],[325,10,325,12],[326,4,326,5],[326,6,326,7],[326,10,326,12],[327,4,327,5],[327,6,327,7],[327,10,327,12],[328,4,328,5],[328,6,328,7],[328,10,328,12],[317,4,317,5],[317,6,317,7],[317,10,317,12],[318,4,318,5],[318,6,318,7],[318,10,318,12],[319,4,319,5],[319,6,319,7],[319,10,319,12],[320,4,320,5],[320,6,320,7],[320,10,320,12],[321,4,321,5],[321,6,321,7],[321,10,321,12],[322,4,322,5],[322,6,322,7],[322,10,322,12],[311,4,311,5],[311,6,311,7],[311,10,311,12],[312,4,312,5],[312,6,312,7],[312,10,312,12],[313,4,313,5],[313,6,313,7],[313,10,313,12],[314,4,314,5],[314,6,314,7],[314,10,314,12],[315,4,315,5],[315,6,315,7],[315,10,315,12],[316,4,316,5],[316,6,316,7],[316,10,316,12],[305,4,305,5],[305,6,305,7],[305,10,305,12],[306,4,306,5],[306,6,306,7],[306,10,306,12],[307,4,307,5],[307,6,307,7],[307,10,307,12],[308,4,308,5],[308,6,308,7],[308,10,308,12],[309,4,309,5],[309,6,309,7],[309,10,309,12],[310,4,310,5],[310,6,310,7],[310,10,310,12],[299,4,299,5],[299,6,299,7],[299,10,299,12],[300,4,300,5],[300,6,300,7],[300,10,300,12],[301,4,301,5],[301,6,301,7],[301,10,301,12],[302,4,302,5],[302,6,302,7],[302,10,302,12],[303,4,303,5],[303,6,303,7],[303,10,303,12],[304,4,304,5],[304,6,304,7],[304,10,304,12],[293,4,293,5],[293,6,293,7],[293,10,293,12],[294,4,294,5],[294,6,294,7],[294,10,294,12],[295,4,295,5],[295,6,295,7],[295,10,295,12],[296,4,296,5],[296,6,296,7],[296,10,296,12],[297,4,297,5],[297,6,297,7],[297,10,297,12],[298,4,298,5],[298,6,298,7],[298,10,298,12],[287,4,287,5],[287,6,287,7],[287,10,287,12],[288,4,288,5],[288,6,288,7],[288,10,288,12],[289,4,289,5],[289,6,289,7],[289,10,289,12],[290,4,290,5],[290,6,290,7],[290,10,290,12],[291,4,291,5],[291,6,291,7],[291,10,291,12],[292,4,292,5],[292,6,292,7],[292,10,292,12],[281,4,281,5],[281,6,281,7],[281,10,281,12],[282,4,282,5],[282,6,282,7],[282,10,282,12],[283,4,283,5],[283,6,283,7],[283,10,283,12],[284,4,284,5],[284,6,284,7],[284,10,284,12],[285,4,285,5],[285,6,285,7],[285,10,285,12],[286,4,286,5],[286,6,286,7],[286,10,286,12],[275,4,275,5],[275,6,275,7],[275,10,275,12],[276,4,276,5],[276,6,276,7],[276,10,276,12],[277,4,277,5],[277,6,277,7],[277,10,277,12],[278,4,278,5],[278,6,278,7],[278,10,278,12],[279,4,279,5],[279,6,279,7],[279,10,279,12],[280,4,280,5],[280,6,280,7],[280,10,280,12],[269,4,269,5],[269,6,269,7],[269,10,269,12],[270,4,270,5],[270,6,270,7],[270,10,270,12],[271,4,271,5],[271,6,271,7],[271,10,271,12],[272,4,272,5],[272,6,272,7],[272,10,272,12],[273,4,273,5],[273,6,273,7],[273,10,273,12],[274,4,274,5],[274,6,274,7],[274,10,274,12],[263,4,263,5],[263,6,263,7],[263,10,263,12],[264,4,264,5],[264,6,264,7],[264,10,264,12],[265,4,265,5],[265,6,265,7],[265,10,265,12],[266,4,266,5],[266,6,266,7],[266,10,266,12],[267,4,267,5],[267,6,267,7],[267,10,267,12],[268,4,268,5],[268,6,268,7],[268,10,268,12],[257,4,257,5],[257,6,257,7],[257,10,257,12],[258,4,258,5],[258,6,258,7],[258,10,258,12],[259,4,259,5],[259,6,259,7],[259,10,259,12],[260,4,260,5],[260,6,260,7],[260,10,260,12],[261,4,261,5],[261,6,261,7],[261,10,261,12],[262,4,262,5],[262,6,262,7],[262,10,262,12],[251,4,251,5],[251,6,251,7],[251,10,251,12],[252,4,252,5],[252,6,252,7],[252,10,252,12],[253,4,253,5],[253,6,253,7],[253,10,253,12],[254,4,254,5],[254,6,254,7],[254,10,254,12],[255,4,255,5],[255,6,255,7],[255,10,255,12],[256,4,256,5],[256,6,256,7],[256,10,256,12],[245,4,245,5],[245,6,245,7],[245,10,245,12],[246,4,246,5],[246,6,246,7],[246,10,246,12],[247,4,247,5],[247,6,247,7],[247,10,247,12],[248,4,248,5],[248,6,248,7],[248,10,248,12],[249,4,249,5],[249,6,249,7],[249,10,249,12],[250,4,250,5],[250,6,250,7],[250,10,250,12],[239,4,239,5],[239,6,239,7],[239,10,239,12],[240,4,240,5],[240,6,240,7],[240,10,240,12],[241,4,241,5],[241,6,241,7],[241,10,241,12],[242,4,242,5],[242,6,242,7],[242,10,242,12],[243,4,243,5],[243,6,243,7],[243,10,243,12],[244,4,244,5],[244,6,244,7],[244,10,244,12],[233,4,233,5],[233,6,233,7],[233,10,233,12],[234,4,234,5],[234,6,234,7],[234,10,234,12],[235,4,235,5],[235,6,235,7],[235,10,235,12],[236,4,236,5],[236,6,236,7],[236,10,236,12],[237,4,237,5],[237,6,237,7],[237,10,237,12],[238,4,238,5],[238,6,238,7],[238,10,238,12],[227,4,227,5],[227,6,227,7],[227,10,227,12],[228,4,228,5],[228,6,228,7],[228,10,228,12],[229,4,229,5],[229,6,229,7],[229,10,229,12],[230,4,230,5],[230,6,230,7],[230,10,230,12],[231,4,231,5],[231,6,231,7],[231,10,231,12],[232,4,232,5],[232,6,232,7],[232,10,232,12],[221,4,221,5],[221,6,221,7],[221,10,221,12],[222,4,222,5],[222,6,222,7],[222,10,222,12],[223,4,223,5],[223,6,223,7],[223,10,223,12],[224,4,224,5],[224,6,224,7],[224,10,224,12],[225,4,225,5],[225,6,225,7],[225,10,225,12],[226,4,226,5],[226,6,226,7],[226,10,226,12],[215,4,215,5],[215,6,215,7],[215,10,215,12],[216,4,216,5],[216,6,216,7],[216,10,216,12],[217,4,217,5],[217,6,217,7],[217,10,217,12],[218,4,218,5],[218,6,218,7],[218,10,218,12],[219,4,219,5],[219,6,219,7],[219,10,219,12],[220,4,220,5],[220,6,220,7],[220,10,220,12],[209,4,209,5],[209,6,209,7],[209,10,209,12],[210,4,210,5],[210,6,210,7],[210,10,210,12],[211,4,211,5],[211,6,211,7],[211,10,211,12],[212,4,212,5],[212,6,212,7],[212,10,212,12],[213,4,213,5],[213,6,213,7],[213,10,213,12],[214,4,214,5],[214,6,214,7],[214,10,214,12],[203,4,203,5],[203,6,203,7],[203,10,203,12],[204,4,204,5],[204,6,204,7],[204,10,204,12],[205,4,205,5],[205,6,205,7],[205,10,205,12],[206,4,206,5],[206,6,206,7],[206,10,206,12],[207,4,207,5],[207,6,207,7],[207,10,207,12],[208,4,208,5],[208,6,208,7],[208,10,208,12],[197,4,197,5],[197,6,197,7],[197,10,197,12],[198,4,198,5],[198,6,198,7],[198,10,198,12],[199,4,199,5],[199,6,199,7],[199,10,199,12],[200,4,200,5],[200,6,200,7],[200,10,200,12],[201,4,201,5],[201,6,201,7],[201,10,201,12],[202,4,202,5],[202,6,202,7],[202,10,202,12],[191,4,191,5],[191,6,191,7],[191,10,191,12],[192,4,192,5],[192,6,192,7],[192,10,192,12],[193,4,193,5],[193,6,193,7],[193,10,193,12],[194,4,194,5],[194,6,194,7],[194,10,194,12],[195,4,195,5],[195,6,195,7],[195,10,195,12],[196,4,196,5],[196,6,196,7],[196,10,196,12],[185,4,185,5],[185,6,185,7],[185,10,185,12],[186,4,186,5],[186,6,186,7],[186,10,186,12],[187,4,187,5],[187,6,187,7],[187,10,187,12],[188,4,188,5],[188,6,188,7],[188,10,188,12],[189,4,189,5],[189,6,189,7],[189,10,189,12],[190,4,190,5],[190,6,190,7],[190,10,190,12],[179,4,179,5],[179,6,179,7],[179,10,179,12],[180,4,180,5],[180,6,180,7],[180,10,180,12],[181,4,181,5],[181,6,181,7],[181,10,181,12],[182,4,182,5],[182,6,182,7],[182,10,182,12],[183,4,183,5]],"merged_total":1507,"flags":["merged_cut"]}
[{"$nulls":59},"DROP DOWN MENU PAGES"]
[{"$nulls":8},"Imported selection"]
[{"$nulls":9},"Go to     "]
[{"$nulls":59},"Production stage"]
[]
[null,null,"?",null,"ProCost search criteria",{"$nulls":4},"ProCost search criteria",{"$nulls":49},"Data entry form"]
[{"$nulls":59},"Search"]
[{"$nulls":59},"Selection"]
[{"$nulls":59},"Actions"]
[{"$nulls":59},"Actions summary"]
[{"$nulls":59},"Unique code summary"]
[{"$nulls":4},"Species / variety name",null,"Unique batch code",null,null,"Selected batches for import to ProSpace",{"$nulls":49},"Import data"]
[{"$nulls":59},"Imported selection"]
[{"$nulls":9},"","",{"$nulls":48},"Space output"]
[{"$nulls":9},"","",{"$nulls":48},"Nursery summary report"]
[{"$nulls":9},"","",{"$nulls":48},"Stage 1"]
[{"$nulls":9},"","",{"$nulls":48},"Final stage for sale"]
[{"$nulls":9},"","",{"$nulls":48},"Stage 2"]
[{"$nulls":9},"","",{"$nulls":48},"Stage 3"]
[{"$nulls":9},"","",{"$nulls":48},"Stage 4"]
[{"$nulls":9},"","",{"$nulls":48},"Stage 5"]
[{"$nulls":9},"","",{"$nulls":48},"Stage 6"]
[{"$nulls":9},"","",{"$nulls":48},"Stage 7"]
[{"$nulls":9},"","",{"$nulls":48},"Stage 8"]
[{"$nulls":9},"","",{"$nulls":48},"Stage 9"]
[{"$nulls":9},"","",{"$nulls":48},"Menu"]
[{"$nulls":9},"","",{"$nulls":48},"User guide"]
[{"$nulls":9},"","",{"$nulls":48},"Contact us"]
[{"$nulls":9},"","",{"$nulls":48},"Nursery details"]
[{"$nulls":9},"",""]
[{"$nulls":9},"",""]
[{"$nulls":9},"",""]
[{"$nulls":9},"",""]
[{"$nulls":9},"",""]
[{"$nulls":9},"",""]
[{"$nulls":9},"",""]
[{"$nulls":9},"",""]
[{"$nulls":9},"",""]
[{"$nulls":9},"",""]
[{"$nulls":9},"",""]
[{"$nulls":9},"",""]
[{"$nulls":9},"",""]
[{"$nulls":9},"",""]
[{"$nulls":9},"",""]
[{"$nulls":9},"",""]
[{"$nulls":9},"",""]
[{"$nulls":9},"",""]
[{"$nulls":9},"",""]
[{"$nulls":9},"",""]
[{"$nulls":9},"",""]
[{"$nulls":9},"",""]
[{"$nulls":9},"",""]
[{"$nulls":9},"",""]
[{"$nulls":9},"",""]
[{"$nulls":9},"",""]
[{"$nulls":9},"",""]
[{"$nulls":9},"",""]
[{"$nulls":9},"",""]
[{"$nulls":9},"",""]
[{"$nulls":9},"",""]
[{"$nulls":9},"",""]
[{"$nulls":9},"",""]
[{"$nulls":9},"",""]
[{"$nulls":9},"",""]
[{"$nulls":9},"",""]
[{"$nulls":9},"",""]
[{"$nulls":9},"",""]
[{"$nulls":9},"",""]
[{"$nulls":9},"",""]
[{"$nulls":9},"",""]
[{"$nulls":9},"",""]
[{"$nulls":9},"",""]
[{"$nulls":9},"",""]
[{"$nulls":9},"",""]
[{"$nulls":9},"",""]
[{"$nulls":9},"",""]
[{"$nulls":9},"",""]
[{"$nulls":9},"",""]
[{"$nulls":9},"",""]
[{"$nulls":9},"",""]
[{"$nulls":9},"",""]
[{"$nulls":9},"",""]
[{"$nulls":9},"",""]
[{"$nulls":9},"",""]
[{"$nulls":9},"",""]
[{"$nulls":9},"",""]
[{"$nulls":9},"",""]
[{"$nulls":9},"",""]
[{"$nulls":9},"",""]
[{"$nulls":9},"",""]
[{"$nulls":9},"",""]
[{"$nulls":9},"",""]
[{"$nulls":9},"",""]
[{"$nulls":9},"",""]
[{"$nulls":9},"",""]
[{"$nulls":9},"",""]
[{"$nulls":9},"",""]
[{"$nulls":9},"",""]
[{"$nulls":9},"",""]
[{"$nulls":9},"",""]
[{"$nulls":9},"",""]
[{"$nulls":9},"",""]
[{"$nulls":9},"",""]
[{"$nulls":9},"",""]
[{"$nulls":9},"",""]
[{"$nulls":9},"",""]
[{"$nulls":9},"",""]
[{"$nulls":9},"",""]
[{"$nulls":9},"",""]
[{"$nulls":9},"",""]
[{"$nulls":9},"",""]
[{"$nulls":9},"",""]
[{"$nulls":9},"",""]
[{"$nulls":9},"",""]
[{"$nulls":9},"",""]
[{"$nulls":9},"",""]
[{"$nulls":9},"",""]
[{"$nulls":9},"",""]
[{"$nulls":9},"",""]
[{"$nulls":9},"",""]
[{"$nulls":9},"",""]
[{"$nulls":9},"",""]
[{"$nulls":9},"",""]
[{"$nulls":9},"",""]
[{"$nulls":9},"",""]
[{"$nulls":9},"",""]
[{"$nulls":9},"",""]
[{"$nulls":9},"",""]
[{"$nulls":9},"",""]
[{"$nulls":9},"",""]
[{"$nulls":9},"",""]
[{"$nulls":9},"",""]
[{"$nulls":9},"",""]
[{"$nulls":9},"",""]
[{"$nulls":9},"",""]
[{"$nulls":9},"",""]
[{"$nulls":9},"",""]
[{"$nulls":9},"",""]
[{"$nulls":9},"",""]
[{"$nulls":9},"",""]
[{"$nulls":9},"",""]
[{"$nulls":9},"",""]
[{"$nulls":9},"",""]
[{"$nulls":9},"",""]
[{"$nulls":9},"",""]
[{"$nulls":9},"",""]
[{"$nulls":9},"",""]
[{"$nulls":9},"",""]
[{"$nulls":9},"",""]
[{"$nulls":9},"",""]
[{"$nulls":9},"",""]
[{"$nulls":9},"",""]
[{"$nulls":9},"",""]
[{"$nulls":9},"",""]
[{"$nulls":9},"",""]
[{"$nulls":9},"",""]
[{"$nulls":9},"",""]
[{"$nulls":9},"",""]
[{"$nulls":9},"",""]
[{"$nulls":9},"",""]
[{"$nulls":9},"",""]
[{"$nulls":9},"",""]
[{"$nulls":9},"",""]
[{"$nulls":9},"",""]
[{"$nulls":9},"",""]
[{"$nulls":9},"",""]
[{"$nulls":9},"",""]
[{"$nulls":9},"",""]
[{"$nulls":9},"",""]
[{"$nulls":9},"",""]
[{"$nulls":9},"",""]
[{"$nulls":9},"",""]
[{"$nulls":9},"",""]
[{"$nulls":9},"",""]
[{"$nulls":9},"",""]
[{"$nulls":9},"",""]
[{"$nulls":9},"",""]
[{"$nulls":9},"",""]
[{"$nulls":9},"",""]
[{"$nulls":9},"",""]
[{"$nulls":9},"",""]
[{"$nulls":9},"",""]
[{"$nulls":9},"",""]
[{"$nulls":9},"",""]
[{"$nulls":9},"",""]
[{"$nulls":9},"",""]
[{"$nulls":9},"",""]
[{"$nulls":9},"",""]
[{"$nulls":9},"",""]
[{"$nulls":9},"",""]
[{"$nulls":9},"",""]
[{"$nulls":9},"",""]
[{"$nulls":9},"",""]
[{"$nulls":9},"",""]
[{"$nulls":9},"",""]
[{"$nulls":9},"",""]
[{"$nulls":9},"",""]
[{"$nulls":9},"",""]
[{"$nulls":9},"",""]
[{"$nulls":9},"",""]
[{"$nulls":9},"",""]
[{"$nulls":9},"",""]
[{"$nulls":9},"",""]
[{"$nulls":9},"",""]
[{"$nulls":9},"",""]
[{"$nulls":9},"",""]
[{"$nulls":9},"",""]
[{"$nulls":9},"",""]
[{"$nulls":9},"",""]
[{"$nulls":9},"",""]
[{"$nulls":9},"",""]
[{"$nulls":9},"",""]
[{"$nulls":9},"",""]
[{"$nulls":9},"",""]
[{"$nulls":9},"",""]
[{"$nulls":9},"",""]
[{"$nulls":9},"",""]
[{"$nulls":9},"",""]
[{"$nulls":9},"",""]
[{"$nulls":9},"",""]
[{"$nulls":9},"",""]
[{"$nulls":9},"",""]
[{"$nulls":9},"",""]
[{"$nulls":9},"",""]
[{"$nulls":9},"",""]
[{"$nulls":9},"",""]
[{"$nulls":9},"",""]
[{"$nulls":9},"",""]
[{"$nulls":9},"",""]
[{"$nulls":9},"",""]
[{"$nulls":9},"",""]
[{"$nulls":9},"",""]
[{"$nulls":9},"",""]
[{"$nulls":9},"",""]
[{"$nulls":9},"",""]
[{"$nulls":9},"",""]
[{"$nulls":9},"",""]
[{"$nulls":9},"",""]
[{"$nulls":9},"",""]
[{"$nulls":9},"",""]
[{"$nulls":9},"",""]
[{"$nulls":9},"",""]
[{"$nulls":9},"",""]
[{"$nulls":9},"",""]
[{"$nulls":9},"",""]
[{"$nulls":9},"",""]
[{"$nulls":9},"",""]
[{"$nulls":9},"",""]
[{"$nulls":9},"",""]
[{"$nulls":9},"",""]
[{"$nulls":9},"",""]
[{"$nulls":9},"",""]
[{"$nulls":9},"",""]
[{"$nulls":9},"",""]
[{"$nulls":9},"",""]
[{"$nulls":9},"",""]
[{"$nulls":9},"",""]
[{"$nulls":9},"",""]
[{"$nulls":9},"",""]
[{"$nulls":9},"",""]
[{"$nulls":9},"",""]
[{"$nulls":9},"",""]
[{"$nulls":9},"",""]
[{"$nulls":9},"",""]
[{"$nulls":9},"",""]
[{"$nulls":9},"",""]
[{"$nulls":9},"",""]
[{"$nulls":9},"",""]
[{"$nulls":9},"",""]
[{"$nulls":9},"",""]
[{"$nulls":9},"",""]
[{"$nulls":9},"",""]
[{"$nulls":9},"",""]
[{"$nulls":9},"",""]
[{"$nulls":9},"",""]
[{"$nulls":9},"",""]
[{"$nulls":9},"",""]
[{"$nulls":9},"",""]
[{"$nulls":9},"",""]
[{"$nulls":9},"",""]
[{"$nulls":9},"",""]
[{"$nulls":9},"",""]
[{"$nulls":9},"",""]
[{"$nulls":9},"",""]
[{"$nulls":9},"",""]
[{"$nulls":9},"",""]
[{"$nulls":9},"",""]
[{"$nulls":9},"",""]
[{"$nulls":9},"",""]
[{"$nulls":9},"",""]
[{"$nulls":9},"",""]
[{"$nulls":9},"",""]
[{"$nulls":9},"",""]
[{"$nulls":9},"",""]
[{"$nulls":9},"",""]
[{"$nulls":9},"",""]
[{"$nulls":9},"",""]
[{"$nulls":9},"",""]
[{"$nulls":9},"",""]
[{"$nulls":9},"",""]
[{"$nulls":9},"",""]
[{"$nulls":9},"",""]
[{"$nulls":9},"",""]
[{"$nulls":9},"",""]
[{"$nulls":9},"",""]
[{"$nulls":9},"",""]
[{"$nulls":9},"",""]
[{"$nulls":9},"",""]
[{"$nulls":9},"",""]
[{"$nulls":9},"",""]
[{"$nulls":9},"",""]
[{"$nulls":9},"",""]
[{"$nulls":9},"",""]
[{"$nulls":9},"",""]
[{"$nulls":9},"",""]
[{"$nulls":9},"",""]
[{"$nulls":9},"",""]
[{"$nulls":9},"",""]
[{"$nulls":9},"",""]
[{"$nulls":9},"",""]
[{"$nulls":9},"",""]
[{"$nulls":9},"",""]
[{"$nulls":9},"",""]
[{"$nulls":9},"",""]
[{"$nulls":9},"",""]
[{"$nulls":9},"",""]
[{"$nulls":9},"",""]
[{"$nulls":9},"",""]
[{"$nulls":9},"",""]
[{"$nulls":9},"",""]
[{"$nulls":9},"",""]
[{"$nulls":9},"",""]
[{"$nulls":9},"",""]
[{"$nulls":9},"",""]
[{"$nulls":9},"",""]
[{"$nulls":9},"",""]
[{"$nulls":9},"",""]
[{"$nulls":9},"",""]
[{"$nulls":9},"",""]
[{"$nulls":9},"",""]
[{"$nulls":9},"",""]
[{"$nulls":9},"",""]
[{"$nulls":9},"",""]
[{"$nulls":9},"",""]
[{"$nulls":9},"",""]
[{"$nulls":9},"",""]
[{"$nulls":9},"",""]
[{"$nulls":9},"",""]
[{"$nulls":9},"",""]
[{"$nulls":9},"",""]
[{"$nulls":9},"",""]
[{"$nulls":9},"",""]
[{"$nulls":9},"",""]
[{"$nulls":9},"",""]
[{"$nulls":9},"",""]
[{"$nulls":9},"",""]
[{"$nulls":9},"",""]
[{"$nulls":9},"",""]
[{"$nulls":9},"",""]
[{"$nulls":9},"",""]
[{"$nulls":9},"",""]
[{"$nulls":9},"",""]
[{"$nulls":9},"",""]
[{"$nulls":9},"",""]
[{"$nulls":9},"",""]
[{"$nulls":9},"",""]
[{"$nulls":9},"",""]
[{"$nulls":9},"",""]
[{"$nulls":9},"",""]
[{"$nulls":9},"",""]
[{"$nulls":9},"",""]
[{"$nulls":9},"",""]
[{"$nulls":9},"",""]
[{"$nulls":9},"",""]
[{"$nulls":9},"",""]
[{"$nulls":9},"",""]
[{"$nulls":9},"",""]
[{"$nulls":9},"",""]
[{"$nulls":9},"",""]
[{"$nulls":9},"",""]
[{"$nulls":9},"",""]
[{"$nulls":9},"",""]
[{"$nulls":9},"",""]
[{"$nulls":9},"",""]
[{"$nulls":9},"",""]
[{"$nulls":9},"",""]
[{"$nulls":9},"",""]
[{"$nulls":9},"",""]
[{"$nulls":9},"",""]
[{"$nulls":9},"",""]
[{"$nulls":9},"",""]
[{"$nulls":9},"",""]
[{"$nulls":9},"",""]
[{"$nulls":9},"",""]
[{"$nulls":9},"",""]
[{"$nulls":9},"",""]
[{"$nulls":9},"",""]
[{"$nulls":9},"",""]
[{"$nulls":9},"",""]
[{"$nulls":9},"",""]
[{"$nulls":9},"",""]
[{"$nulls":9},"",""]
[{"$nulls":9},"",""]
[{"$nulls":9},"",""]
[{"$nulls":9},"",""]
[{"$nulls":9},"",""]
[{"$nulls":9},"",""]
[{"$nulls":9},"",""]
[{"$nulls":9},"",""]
[{"$nulls":9},"",""]
[{"$nulls":9},"",""]
[{"$nulls":9},"",""]
[{"$nulls":9},"",""]
[{"$nulls":9},"",""]
[{"$nulls":9},"",""]
[{"$nulls":9},"",""]
[{"$nulls":9},"",""]
[{"$nulls":9},"",""]
[{"$nulls":9},"",""]
[{"$nulls":9},"",""]
[{"$nulls":9},"",""]
[{"$nulls":9},"",""]
[{"$nulls":9},"",""]
[{"$nulls":9},"",""]
[{"$nulls":9},"",""]
[{"$nulls":9},"",""]
[{"$nulls":9},"",""]
[{"$nulls":9},"",""]
[{"$nulls":9},"",""]
[{"$nulls":9},"",""]
[{"$nulls":9},"",""]
[{"$nulls":9},"",""]
[{"$nulls":9},"",""]
[{"$nulls":9},"",""]
[{"$nulls":9},"",""]
[{"$nulls":9},"",""]
[{"$nulls":9},"",""]
[{"$nulls":9},"",""]
[{"$nulls":9},"",""]
[{"$nulls":9},"",""]
[{"$nulls":9},"",""]
[{"$nulls":9},"",""]
[{"$nulls":9},"",""]
[{"$nulls":9},"",""]
[{"$nulls":9},"",""]
[{"$nulls":9},"",""]
[{"$nulls":9},"",""]
[{"$nulls":9},"",""]
[{"$nulls":9},"",""]
[{"$nulls":9},"",""]
[{"$nulls":9},"",""]
[{"$nulls":9},"",""]
[{"$nulls":9},"",""]
[{"$nulls":9},"",""]
[{"$nulls":9},"",""]
[{"$nulls":9},"",""]
[{"$nulls":9},"",""]
[{"$nulls":9},"",""]
[{"$nulls":9},"",""]
[{"$nulls":9},"",""]
[{"$nulls":9},"",""]
[{"$nulls":9},"",""]
[{"$nulls":9},"",""]
[{"$nulls":9},"",""]
[{"$nulls":9},"",""]
[{"$nulls":9},"",""]
[{"$nulls":9},"",""]
[{"$nulls":9},"",""]
[{"$nulls":9},"",""]
[{"$nulls":9},"",""]
[{"$nulls":9},"",""]
[{"$nulls":9},"",""]
[{"$nulls":9},"",""]
[{"$nulls":9},"",""]
[{"$nulls":9},"",""]
[{"$nulls":9},"",""]
[{"$nulls":9},"",""]
[{"$nulls":9},"",""]
[{"$nulls":9},"",""]
[{"$nulls":9},"",""]
[{"$nulls":9},"",""]
[{"$nulls":9},"",""]
[{"$nulls":9},"",""]
[{"$nulls":9},"",""]
[{"$nulls":9},"",""]
[{"$nulls":9},"",""]
[{"$nulls":9},"",""]
[{"$nulls":9},"",""]
[{"$nulls":9},"",""]
[{"$nulls":9},"",""]
[{"$nulls":9},"",""]
[{"$nulls":9},"",""]
[{"$nulls":9},"",""]
[{"$nulls":9},"",""]
[{"$nulls":9},"",""]
[{"$nulls":9},"",""]
[{"$nulls":9},"",""]
[{"$nulls":9},"",""]
[{"$nulls":9},"",""]
[{"$nulls":9},"",""]
[{"$nulls":9},"",""]
[{"$nulls":9},"",""]
[{"$nulls":9},"",""]
[{"$nulls":9},"",""]
[{"$nulls":9},"",""]
[{"$nulls":9},"",""]
[{"$nulls":9},"",""]
[{"$nulls":9},"",""]
[{"$nulls":9},"",""]
[{"$nulls":9},"",""]
[{"$nulls":9},"",""]
[{"$nulls":9},"",""]
[{"$nulls":9},"",""]
[{"$nulls":9},"",""]

{"sheet":"Data entry form","index":3,"n_rows":218,"n_cols":181,"rows_kept":218,"cut":false,"hidden":false,"merged":[[15,9,15,11],[19,9,19,11],[7,9,7,11]]}
[{"$nulls":58},"DROP DOWN MENU PAGES",{"$nulls":4},"PRODUCTION STAGES",null,null,null,"?","PLANT STARTING MATERIAL",null,null,"?","SITE OR ENVIRONMENT TYPE (HIGHEST LEVEL OF DIFFERENTIATION)",{"$nulls":4},"?","AREAS WITHIN THE SITE OR ENVIRONMENT TYPES",{"$nulls":4},"?","CONTAINER DATA",null,null,null,"?","SPACING DESCRIPTION",null,null,"?","DENSITIES (CONTAINERS PER M2)",{"$nulls":58},"CHANGING DROP DOWN LIST",null,null,null,"ADJUSTABLE DISPATCH DATE",null,null,"?","WEEK NUMBERING AND RULES",{"$nulls":7},"?","WEEK CONVERSION TO DATES",{"$nulls":6},"ACTIONS",null,null,null,"SEQUENTIAL"]
[{"$nulls":9},"   Data entry form",{"$nulls":5},"Go to  ",{"$nulls":153},"Update the Week/Year column"]
[{"$nulls":160},"• A week begins with a Monday. "]
[{"$nulls":58},"Production stage",{"$nulls":4},"Production stage","Number",null,null,null,"Plant description",null,null,null,"Main area names","Max. area (m2)","Area allocation check",null,null,null,"Name","Max. area (m2)","Main area type",null,null,null,"Pot or tray types","Product units",null,null,null,"Spacing description",{"$nulls":4},"Spacing description",{"$nulls":65},"• The first week of a year (01) is the one which includes the first Thursday,  ",{"$nulls":8},"Start date","End date","Weeknumber","Week/Year"]
[{"$nulls":63},"None",0,null,null,null,"None",null,null,null,"No change",0,"All allocated",null,null,null,"No change",0,"No selection",null,null,null,"No change",0,null,null,null,"No change",null,null,null,"Pot or tray types",{"$f":"IF($CL$5<>\"\",$CL$5,\"\")","v":"No change"},{"$f":"IF($CL$6<>\"\",$CL$6,\"\")","v":""},{"$f":"IF($CL$7<>\"\",$CL$7,\"\")","v":""},{"$f":"IF($CL$8<>\"\",$CL$8,\"\")","v":""},{"$f":"IF($CL$9<>\"\",$CL$9,\"\")","v":""},{"$f":"IF($CL$10<>\"\",$CL$10,\"\")","v":""},{"$f":"IF($CL$11<>\"\",$CL$11,\"\")","v":""},{"$f":"IF($CL$12<>\"\",$CL$12,\"\")","v":""},{"$f":"IF($CL$13<>\"\",$CL$13,\"\")","v":""},{"$f":"IF($CL$14<>\"\",$CL$14,\"\")","v":""},{"$f":"IF($CL$15<>\"\",$CL$15,\"\")","v":""},{"$f":"IF($CL$16<>\"\",$CL$16,\"\")","v":""},{"$f":"IF($CL$17<>\"\",$CL$17,\"\")","v":""},{"$f":"IF($CL$18<>\"\",$CL$18,\"\")","v":""},{"$f":"IF($CL$19<>\"\",$CL$19,\"\")","v":""},{"$f":"IF($CL$20<>\"\",$CL$20,\"\")","v":""},{"$f":"IF($CL$21<>\"\",$CL$21,\"\")","v":""},{"$f":"IF($CL$22<>\"\",$CL$22,\"\")","v":""},{"$f":"IF($CL$23<>\"\",$CL$23,\"\")","v":""},{"$f":"IF($CL$24<>\"\",$CL$24,\"\")","v":""},{"$f":"IF($CL$25<>\"\",$CL$25,\"\")","v":""},{"$f":"IF($CL$26<>\"\",$CL$26,\"\")","v":""},{"$f":"IF($CL$27<>\"\",$CL$27,\"\")","v":""},{"$f":"IF($CL$28<>\"\",$CL$28,\"\")","v":""},{"$f":"IF($CL$29<>\"\",$CL$29,\"\")","v":""},{"$f":"IF($CL$30<>\"\",$CL$30,\"\")","v":""},{"$f":"IF($CL$31<>\"\",$CL$31,\"\")","v":""},{"$f":"IF($CL$32<>\"\",$CL$32,\"\")","v":""},{"$f":"IF($CL$33<>\"\",$CL$33,\"\")","v":""},{"$f":"IF($CL$34<>\"\",$CL$34,\"\")","v":""},{"$f":"IF($CL$35<>\"\",$CL$35,\"\")","v":""},{"$f":"IF($CL$36<>\"\",$CL$36,\"\")","v":""},{"$f":"IF($CL$37<>\"\",$CL$37,\"\")","v":""},{"$f":"IF($CL$38<>\"\",$CL$38,\"\")","v":""},{"$f":"IF($CL$39<>\"\",$CL$39,\"\")","v":""},{"$f":"IF($CL$40<>\"\",$CL$40,\"\")","v":""},{"$f":"IF($CL$41<>\"\",$CL$41,\"\")","v":""},{"$f":"IF($CL$42<>\"\",$CL$42,\"\")","v":""},{"$f":"IF($CL$43<>\"\",$CL$43,\"\")","v":""},{"$f":"IF($CL$44<>\"\",$CL$44,\"\")","v":""},{"$f":"IF($CL$45<>\"\",$CL$45,\"\")","v":""},{"$f":"IF($CL$46<>\"\",$CL$46,\"\")","v":""},{"$f":"IF($CL$47<>\"\",$CL$47,\"\")","v":""},{"$f":"IF($CL$48<>\"\",$CL$48,\"\")","v":""},{"$f":"IF($CL$49<>\"\",$CL$49,\"\")","v":""},{"$f":"IF($CL$50<>\"\",$CL$50,\"\")","v":""},{"$f":"IF($CL$51<>\"\",$CL$51,\"\")","v":""},{"$f":"IF($CL$52<>\"\",$CL$52,\"\")","v":""},{"$f":"IF($CL$53<>\"\",$CL$53,\"\")","v":""},{"$f":"IF($CL$54<>\"\",$CL$54,\"\")","v":""},{"$f":"IF($CL$55<>\"\",$CL$55,\"\")","v":""},{"$f":"IF($CL$56<>\"\",$CL$56,\"\")","v":""},{"$f":"IF($CL$57<>\"\",$CL$57,\"\")","v":""},{"$f":"IF($CL$58<>\"\",$CL$58,\"\")","v":""},{"$f":"IF($CL$59<>\"\",$CL$59,\"\")","v":""},null,null,null,"Main area names",null,null,null,"Options",null,null,null," or equivalently the one which includes January 4. ",{"$nulls":11},"No selection",null,null,null,"No changes"]
[null,null,"Product-line stage-specific inputs",{"$nulls":6},"Remember to use the red \"Update space\" button (above) to ensure that the correct area is calculated.",{"$nulls":48},"Data entry form",{"$nulls":4},"Final stage for sale",10,{"$nulls":15},"No change",{"$nulls":12},{"$f":"IF(CG5<>\"\",CG5,\"\")","v":"No change"},{"$nulls":62},"Yes",null,null,null,"Enter the date (dd/mm/yyyy) from the list below for the",{"$nulls":8},{"$f":"FI7","v":"2011-01-03"},{"$f":"FN6+6","v":"2011-01-09"},1,"1/2011",{"$nulls":7},8]
[{"$nulls":16},"Error checking comments",{"$nulls":41},"Search",{"$nulls":4},"Stage 1",1,{"$nulls":15},"No change",{"$nulls":12},{"$f":"IF(CG6<>\"\",CG6,\"\")","v":""},{"$nulls":58},"No change",null,null,null,"No",null,null,null,"Monday of week 1 of the appropriate year.",null,null,null,"2011-01-03",{"$nulls":4},{"$f":"FO6+1","v":"2011-01-10"},{"$f":"FN7+6","v":"2011-01-16"},2,"2/2011",{"$nulls":7},9]
[null,null,"?",null,"Species/variety name (at least two words)",{"$nulls":4},"",{"$nulls":6},{"$f":"IF(J8=\"\",\"Error: Enter species or variety name\",\"Okay\")","v":"Error: Enter species or variety name"},{"$nulls":41},"Selection",{"$nulls":4},"Stage 2",2,{"$nulls":15},"No change",{"$nulls":12},{"$f":"IF(CG7<>\"\",CG7,\"\")","v":""},{"$nulls":66},"Check: Associated week day",null,null,null,{"$f":"TEXT(FI7,\"dddd\")","v":"Monday"},{"$nulls":4},{"$f":"FO7+1","v":"2011-01-17"},{"$f":"FN8+6","v":"2011-01-23"},3,"3/2011",{"$nulls":7},10]
[{"$nulls":58},"Actions",{"$nulls":4},"Stage 3",3,{"$nulls":15},"No change",{"$nulls":12},"",{"$nulls":66},"CLEAR WEEK NUMBERS WHEN THE DATE IS CHANGED",{"$nulls":8},"2011-01-24","2011-01-30",4,"4/2011",{"$nulls":7},11]
[null,null,"?",null,"Select the type of starting plant material",{"$nulls":53},"Actions summary",{"$nulls":4},"Stage 4",4,{"$nulls":15},"No change",{"$nulls":12},"",{"$nulls":75},"2011-01-31","2011-02-06",5,"5/2011",{"$nulls":7},12]
[{"$nulls":58},"Unique code summary",{"$nulls":4},"Stage 5",5,{"$nulls":15},"No change",{"$nulls":12},"",{"$nulls":66},"Table of dates meeting the rules for the International Week Number Standard",{"$nulls":8},"2011-02-07","2011-02-13",6,"6/2011",{"$nulls":7},13]
[null,null,"?",null,"Select the production stage  (with Actions in box)",{"$nulls":53},"Import data",{"$nulls":4},"Stage 6",6,{"$nulls":15},"No change",{"$nulls":12},"",{"$nulls":66},"Year","Monday Week 1","1st Thursday of year",null,"Weeks per year",{"$nulls":4},"2011-02-14","2011-02-20",7,"7/2011",{"$nulls":7},14]
[{"$nulls":58},"Imported selection",{"$nulls":4},"Stage 7",7,{"$nulls":15},"No change",{"$nulls":12},"",{"$nulls":66},2011,"2011-01-03","2011-01-06",null,52,{"$nulls":4},"2011-02-21","2011-02-27",8,"8/2011",{"$nulls":7},15]
[null,null,"?",null,"Starting date (dd/mm/yyyy)",{"$nulls":8},"",null,null,{"$f":"IF(J14=\"\",\"Error: Enter starting date\",IF(N14=\"\",\"Error: Enter a starting week number\",\"Okay\"))","v":"Error: Enter starting date"},{"$nulls":41},"Space output",{"$nulls":4},"Stage 8",8,{"$nulls":15},"No change",{"$nulls":12},"",{"$nulls":66},2012,"2012-01-02",{"$f":"FF14+3","v":"2012-01-05"},null,52,{"$nulls":4},"2011-02-28","2011-03-06",9,"9/2011",{"$nulls":7},16]
[{"$nulls":58},"Nursery summary report",{"$nulls":4},"Stage 9",9,{"$nulls":15},"No change",{"$nulls":12},"",{"$nulls":66},2013,"2012-12-31","2013-01-03",null,52,{"$nulls":4},"2011-03-07","2011-03-13",10,"10/2011",{"$nulls":7},17]
[null,null,"?",null,"Create unique batch code",{"$nulls":4},"",{"$nulls":6},{"$f":"IF(J16=\"\",\"Error: Create code\",\"Okay\")","v":"Error: Create code"},{"$nulls":41},"Stage 1",{"$nulls":21},"No change",{"$nulls":12},"",{"$nulls":66},2014,"2013-12-30","2014-01-02",null,52,{"$nulls":4},"2011-03-14","2011-03-20",11,"11/2011",{"$nulls":7},18]
[{"$nulls":58},"Final stage for sale",{"$nulls":21},"No change",{"$nulls":12},"",{"$nulls":66},2015,"2014-12-29","2015-01-01",null,53,{"$nulls":4},"2011-03-21","2011-03-27",12,"12/2011",{"$nulls":7},19]
[null,null,"?",null,"End date (dd/mm/yyyy)",{"$nulls":8},"",null,null,{"$f":"IF(J18=\"\",\"Error: Enter end date\",IF(N18=\"\",\"Error: Enter dispatch week number\",\"Okay\"))","v":"Error: Enter end date"},{"$nulls":41},"Stage 2",{"$nulls":21},"No change",{"$nulls":12},"",{"$nulls":66},2016,"2016-01-04","2016-01-07",null,52,{"$nulls":4},"2011-03-28","2011-04-03",13,"13/2011",{"$nulls":7},20]
[{"$nulls":58},"Stage 3",{"$nulls":21},"No change",{"$nulls":12},"",{"$nulls":66},2017,"2017-01-02","2017-01-05",null,52,{"$nulls":4},"2011-04-04","2011-04-10",14,"14/2011",{"$nulls":7},21]
[null,null,"?",null,"Sales order number",null,null,null,"  §","",{"$nulls":6},{"$f":"IF(J20=\"\",\"Enter order number (optional)\",\"Okay\")","v":"Enter order number (optional)"},{"$nulls":41},"Stage 4",{"$nulls":21},"No change",{"$nulls":12},"",{"$nulls":66},2018,"2018-01-01","2018-01-04",null,52,{"$nulls":4},"2011-04-11","2011-04-17",15,"15/2011",{"$nulls":7},22]
[{"$nulls":58},"Stage 5",{"$nulls":21},"No change",{"$nulls":12},"",{"$nulls":66},2019,"2018-12-31","2019-01-03",null,52,{"$nulls":4},"2011-04-18","2011-04-24",16,"16/2011",{"$nulls":7},23]
[null,null,"?",null,"Number of 'units' in batch",{"$nulls":11},{"$f":"IF(J22=\"\",\"Error: Enter total units for batch\",\"Okay\")","v":"Error: Enter total units for batch"},{"$nulls":41},"Stage 6",{"$nulls":21},"No change",{"$nulls":12},"",{"$nulls":66},2020,"2019-12-30","2020-01-02",null,53,{"$nulls":4},"2011-04-25","2011-05-01",17,"17/2011",{"$nulls":7},24]
[{"$nulls":58},"Stage 7",{"$nulls":21},"No change",{"$nulls":12},"",{"$nulls":66},2021,"2021-01-04","2021-01-07",null,52,{"$nulls":4},"2011-05-02","2011-05-08",18,"18/2011",{"$nulls":7},25]
[null,null,"?",null,"Select container type",{"$nulls":53},"Stage 8",{"$nulls":21},"No change",{"$nulls":12},"",{"$nulls":66},2022,"2022-01-03","2022-01-06",null,52,{"$nulls":4},"2011-05-09","2011-05-15",19,"19/2011",{"$nulls":7},26]
[{"$nulls":58},"Stage 9",{"$nulls":21},"No change",{"$nulls":12},"",{"$nulls":66},2023,"2023-01-02","2023-01-05",null,52,{"$nulls":4},"2011-05-16","2011-05-22",20,"20/2011",{"$nulls":7},27]
[null,null,"?",null,"Select the spacing description",{"$nulls":53},"Menu",{"$nulls":21},"No change",{"$nulls":12},"",{"$nulls":66},2024,"2024-01-01","2024-01-04",null,52,{"$nulls":4},"2011-05-23","2011-05-29",21,"21/2011",{"$nulls":7},28]
[{"$nulls":58},"User guide",{"$nulls":21},"No change",{"$nulls":12},"",{"$nulls":66},2025,"2024-12-30","2025-01-02",null,52,{"$nulls":4},"2011-05-30","2011-06-05",22,"22/2011",{"$nulls":7},29]
[null,null,"?",null,"Crop density (product units per m2)",{"$nulls":5},"      Batch area (m2)     ",{"$nulls":47},"Contact us",{"$nulls":21},"No change",{"$nulls":12},"",{"$nulls":66},2026,"2025-12-29","2026-01-01",null,53,{"$nulls":4},"2011-06-06","2011-06-12",23,"23/2011",{"$nulls":7},30]
[{"$nulls":58},"Nursery details",{"$nulls":21},"No change",{"$nulls":12},"",{"$nulls":75},"2011-06-13","2011-06-19",24,"24/2011",{"$nulls":7},31]
[null,null,"?",null,"Site or environment type",{"$nulls":75},"No change",{"$nulls":12},"",{"$nulls":75},"2011-06-20","2011-06-26",25,"25/2011",{"$nulls":7},32]
[{"$nulls":80},"No change",{"$nulls":12},"",{"$nulls":75},"2011-06-27","2011-07-03",26,"26/2011",{"$nulls":7},33]
[null,null,"?",null,"Area name or code",{"$nulls":75},"No change",{"$nulls":12},"",{"$nulls":75},"2011-07-04","2011-07-10",27,"27/2011",{"$nulls":7},34]
[{"$nulls":93},"",{"$nulls":75},"2011-07-11","2011-07-17",28,"28/2011",{"$nulls":7},35]
[null,null,"?",null,"Surplus or loss per plant (£/plant) from ProCost:",{"$nulls":164},"2011-07-18","2011-07-24",29,"29/2011",{"$nulls":7},36]
[{"$nulls":93},"",{"$nulls":75},"2011-07-25","2011-07-31",30,"30/2011",{"$nulls":7},37]
[{"$nulls":93},"",{"$nulls":75},"2011-08-01","2011-08-07",31,"31/2011",{"$nulls":7},38]
[{"$nulls":169},"2011-08-08","2011-08-14",32,"32/2011",{"$nulls":7},39]
[{"$nulls":169},"2011-08-15","2011-08-21",33,"33/2011",{"$nulls":7},40]
[{"$nulls":93},{"$f":"IF(CG36<>\"\",CG36,\"\")","v":""},{"$nulls":75},"2011-08-22","2011-08-28",34,"34/2011",{"$nulls":7},41]
[{"$nulls":93},"",{"$nulls":75},"2011-08-29","2011-09-04",35,"35/2011",{"$nulls":7},42]
[{"$nulls":93},"",{"$nulls":75},"2011-09-05","2011-09-11",36,"36/2011",{"$nulls":7},43]
[{"$nulls":93},"",{"$nulls":75},"2011-09-12","2011-09-18",37,"37/2011",{"$nulls":7},44]
[{"$nulls":93},"",{"$nulls":75},"2011-09-19","2011-09-25",38,"38/2011",{"$nulls":7},45]
[{"$nulls":93},"",{"$nulls":75},"2011-09-26","2011-10-02",39,"39/2011",{"$nulls":7},46]
[{"$nulls":93},"",{"$nulls":75},"2011-10-03","2011-10-09",40,"40/2011",{"$nulls":7},47]
[{"$nulls":93},"",{"$nulls":75},"2011-10-10","2011-10-16",41,"41/2011",{"$nulls":7},48]
[{"$nulls":93},"",{"$nulls":75},"2011-10-17","2011-10-23",42,"42/2011",{"$nulls":7},49]
[{"$nulls":93},"",{"$nulls":75},"2011-10-24","2011-10-30",43,"43/2011",{"$nulls":7},50]
[{"$nulls":93},"",{"$nulls":75},"2011-10-31","2011-11-06",44,"44/2011",{"$nulls":7},51]
[{"$nulls":93},"",{"$nulls":75},"2011-11-07","2011-11-13",45,"45/2011",{"$nulls":7},52]
[{"$nulls":93},"",{"$nulls":75},"2011-11-14","2011-11-20",46,"46/2011",{"$nulls":7},53]
[{"$nulls":93},"",{"$nulls":75},"2011-11-21","2011-11-27",47,"47/2011",{"$nulls":7},54]
[{"$nulls":93},"",{"$nulls":75},"2011-11-28","2011-12-04",48,"48/2011",{"$nulls":7},55]
[{"$nulls":93},"",{"$nulls":75},"2011-12-05","2011-12-11",49,"49/2011",{"$nulls":7},56]
[{"$nulls":93},{"$f":"IF(CG54<>\"\",CG54,\"\")","v":""},{"$nulls":75},"2011-12-12","2011-12-18",50,"50/2011",{"$nulls":7},57]
[{"$nulls":93},"",{"$nulls":75},"2011-12-19","2011-12-25",51,"51/2011",{"$nulls":7},58]
[{"$nulls":93},"",{"$nulls":75},"2011-12-26","2012-01-01",52,"52/2011",{"$nulls":7},59]
[{"$nulls":93},"",{"$nulls":75},"2012-01-02","2012-01-08",1,"1/2012",{"$nulls":7},60]
[{"$nulls":93},"",{"$nulls":75},"2012-01-09","2012-01-15",2,"2/2012",{"$nulls":7},61]
[{"$nulls":93},{"$f":"IF(CG59<>\"\",CG59,\"\")","v":""},{"$nulls":75},"2012-01-16","2012-01-22",3,"3/2012",{"$nulls":7},62]
[{"$nulls":169},"2012-01-23","2012-01-29",4,"4/2012",{"$nulls":7},63]
[{"$nulls":169},"2012-01-30","2012-02-05",5,"5/2012",{"$nulls":7},64]
[{"$nulls":169},"2012-02-06","2012-02-12",6,"6/2012",{"$nulls":7},65]
[{"$nulls":169},"2012-02-13","2012-02-19",7,"7/2012",{"$nulls":7},66]
[{"$nulls":169},"2012-02-20","2012-02-26",8,"8/2012",{"$nulls":7},67]
[{"$nulls":169},"2012-02-27","2012-03-04",9,"9/2012",{"$nulls":7},68]
[{"$nulls":169},"2012-03-05","2012-03-11",10,"10/2012",{"$nulls":7},69]
[{"$nulls":169},"2012-03-12","2012-03-18",11,"11/2012",{"$nulls":7},70]
[{"$nulls":169},"2012-03-19","2012-03-25",12,"12/2012",{"$nulls":7},71]
[{"$nulls":169},"2012-03-26","2012-04-01",13,"13/2012",{"$nulls":7},72]
[{"$nulls":169},"2012-04-02","2012-04-08",14,"14/2012",{"$nulls":7},73]
[{"$nulls":169},{"$f":"FO71+1","v":"2012-04-09"},{"$f":"FN72+6","v":"2012-04-15"},15,"15/2012",{"$nulls":7},74]
[{"$nulls":169},"2012-04-16","2012-04-22",16,"16/2012",{"$nulls":7},75]
[{"$nulls":169},"2012-04-23","2012-04-29",17,"17/2012",{"$nulls":7},76]
[{"$nulls":169},"2012-04-30","2012-05-06",18,"18/2012",{"$nulls":7},77]
[{"$nulls":169},"2012-05-07","2012-05-13",19,"19/2012",{"$nulls":7},78]
[{"$nulls":169},"2012-05-14","2012-05-20",20,"20/2012",{"$nulls":7},79]
[{"$nulls":169},"2012-05-21","2012-05-27",21,"21/2012",{"$nulls":7},80]
[{"$nulls":169},"2012-05-28","2012-06-03",22,"22/2012",{"$nulls":7},81]
[{"$nulls":169},"2012-06-04","2012-06-10",23,"23/2012",{"$nulls":7},82]
[{"$nulls":169},"2012-06-11","2012-06-17",24,"24/2012",{"$nulls":7},83]
[{"$nulls":169},"2012-06-18","2012-06-24",25,"25/2012",{"$nulls":7},84]
[{"$nulls":169},"2012-06-25","2012-07-01",26,"26/2012",{"$nulls":7},85]
[{"$nulls":169},"2012-07-02","2012-07-08",27,"27/2012",{"$nulls":7},86]
[{"$nulls":169},"2012-07-09","2012-07-15",28,"28/2012",{"$nulls":7},87]
[{"$nulls":169},"2012-07-16","2012-07-22",29,"29/2012",{"$nulls":7},88]
[{"$nulls":169},"2012-07-23","2012-07-29",30,"30/2012",{"$nulls":7},89]
[{"$nulls":169},"2012-07-30","2012-08-05",31,"31/2012",{"$nulls":7},90]
[{"$nulls":169},"2012-08-06","2012-08-12",32,"32/2012",{"$nulls":7},91]
[{"$nulls":169},"2012-08-13","2012-08-19",33,"33/2012",{"$nulls":7},92]
[{"$nulls":169},"2012-08-20","2012-08-26",34,"34/2012",{"$nulls":7},93]
[{"$nulls":169},"2012-08-27","2012-09-02",35,"35/2012",{"$nulls":7},94]
[{"$nulls":169},"2012-09-03","2012-09-09",36,"36/2012",{"$nulls":7},95]
[{"$nulls":169},"2012-09-10","2012-09-16",37,"37/2012",{"$nulls":7},96]
[{"$nulls":169},"2012-09-17","2012-09-23",38,"38/2012",{"$nulls":7},97]
[{"$nulls":169},"2012-09-24","2012-09-30",39,"39/2012",{"$nulls":7},98]
[{"$nulls":169},"2012-10-01","2012-10-07",40,"40/2012",{"$nulls":7},99]
[{"$nulls":169},"2012-10-08","2012-10-14",41,"41/2012",{"$nulls":7},100]
[{"$nulls":169},"2012-10-15","2012-10-21",42,"42/2012",{"$nulls":7},101]
[{"$nulls":169},"2012-10-22","2012-10-28",43,"43/2012",{"$nulls":7},102]
[{"$nulls":169},"2012-10-29","2012-11-04",44,"44/2012",{"$nulls":7},103]
[{"$nulls":169},"2012-11-05","2012-11-11",45,"45/2012",{"$nulls":7},104]
[{"$nulls":169},"2012-11-12","2012-11-18",46,"46/2012",{"$nulls":7},105]
[{"$nulls":169},"2012-11-19","2012-11-25",47,"47/2012",{"$nulls":7},106]
[{"$nulls":169},"2012-11-26","2012-12-02",48,"48/2012",{"$nulls":7},107]
[{"$nulls":169},"2012-12-03","2012-12-09",49,"49/2012",{"$nulls":7},108]
[{"$nulls":169},"2012-12-10","2012-12-16",50,"50/2012",{"$nulls":7},109]
[{"$nulls":169},"2012-12-17","2012-12-23",51,"51/2012",{"$nulls":7},110]
[{"$nulls":169},"2012-12-24","2012-12-30",52,"52/2012",{"$nulls":7},111]
[{"$nulls":169},"2012-12-31","2013-01-06",1,"1/2013",{"$nulls":7},112]
[{"$nulls":169},"2013-01-07","2013-01-13",2,"2/2013",{"$nulls":7},113]
[{"$nulls":169},"2013-01-14","2013-01-20",3,"3/2013",{"$nulls":7},114]
[{"$nulls":169},"2013-01-21","2013-01-27",4,"4/2013",{"$nulls":7},115]
[{"$nulls":169},"2013-01-28","2013-02-03",5,"5/2013",{"$nulls":7},116]
[{"$nulls":169},"2013-02-04","2013-02-10",6,"6/2013",{"$nulls":7},117]
[{"$nulls":169},"2013-02-11","2013-02-17",7,"7/2013",{"$nulls":7},118]
[{"$nulls":169},"2013-02-18","2013-02-24",8,"8/2013",{"$nulls":7},119]
[{"$nulls":169},"2013-02-25","2013-03-03",9,"9/2013",{"$nulls":7},120]
[{"$nulls":169},"2013-03-04","2013-03-10",10,"10/2013",{"$nulls":7},121]
[{"$nulls":169},"2013-03-11","2013-03-17",11,"11/2013",{"$nulls":7},122]
[{"$nulls":169},"2013-03-18","2013-03-24",12,"12/2013",{"$nulls":7},123]
[{"$nulls":169},"2013-03-25","2013-03-31",13,"13/2013",{"$nulls":7},124]
[{"$nulls":169},"2013-04-01","2013-04-07",14,"14/2013",{"$nulls":7},125]
[{"$nulls":169},"2013-04-08","2013-04-14",15,"15/2013",{"$nulls":7},126]
[{"$nulls":169},"2013-04-15","2013-04-21",16,"16/2013",{"$nulls":7},127]
[{"$nulls":169},"2013-04-22","2013-04-28",17,"17/2013",{"$nulls":7},128]
[{"$nulls":169},"2013-04-29","2013-05-05",18,"18/2013",{"$nulls":7},129]
[{"$nulls":169},"2013-05-06","2013-05-12",19,"19/2013",{"$nulls":7},130]
[{"$nulls":169},"2013-05-13","2013-05-19",20,"20/2013",{"$nulls":7},131]
[{"$nulls":169},"2013-05-20","2013-05-26",21,"21/2013",{"$nulls":7},132]
[{"$nulls":169},"2013-05-27","2013-06-02",22,"22/2013",{"$nulls":7},133]
[{"$nulls":169},"2013-06-03","2013-06-09",23,"23/2013",{"$nulls":7},134]
[{"$nulls":169},"2013-06-10","2013-06-16",24,"24/2013",{"$nulls":7},135]
[{"$nulls":169},"2013-06-17","2013-06-23",25,"25/2013",{"$nulls":7},136]
[{"$nulls":169},"2013-06-24","2013-06-30",26,"26/2013",{"$nulls":7},137]
[{"$nulls":169},{"$f":"FO135+1","v":"2013-07-01"},{"$f":"FN136+6","v":"2013-07-07"},27,"27/2013",{"$nulls":7},138]
[{"$nulls":169},"2013-07-08","2013-07-14",28,"28/2013",{"$nulls":7},139]
[{"$nulls":169},"2013-07-15","2013-07-21",29,"29/2013",{"$nulls":7},140]
[{"$nulls":169},"2013-07-22","2013-07-28",30,"30/2013",{"$nulls":7},141]
[{"$nulls":169},"2013-07-29","2013-08-04",31,"31/2013",{"$nulls":7},142]
[{"$nulls":169},"2013-08-05","2013-08-11",32,"32/2013",{"$nulls":7},143]
[{"$nulls":169},"2013-08-12","2013-08-18",33,"33/2013",{"$nulls":7},144]
[{"$nulls":169},"2013-08-19","2013-08-25",34,"34/2013",{"$nulls":7},145]
[{"$nulls":169},"2013-08-26","2013-09-01",35,"35/2013",{"$nulls":7},146]
[{"$nulls":169},"2013-09-02","2013-09-08",36,"36/2013",{"$nulls":7},147]
[{"$nulls":169},"2013-09-09","2013-09-15",37,"37/2013",{"$nulls":7},148]
[{"$nulls":169},"2013-09-16","2013-09-22",38,"38/2013",{"$nulls":7},149]
[{"$nulls":169},"2013-09-23","2013-09-29",39,"39/2013",{"$nulls":7},150]
[{"$nulls":169},"2013-09-30","2013-10-06",40,"40/2013",{"$nulls":7},151]
[{"$nulls":169},"2013-10-07","2013-10-13",41,"41/2013",{"$nulls":7},152]
[{"$nulls":169},"2013-10-14","2013-10-20",42,"42/2013",{"$nulls":7},153]
[{"$nulls":169},"2013-10-21","2013-10-27",43,"43/2013",{"$nulls":7},154]
[{"$nulls":169},"2013-10-28","2013-11-03",44,"44/2013",{"$nulls":7},155]
[{"$nulls":169},"2013-11-04","2013-11-10",45,"45/2013",{"$nulls":7},156]
[{"$nulls":169},"2013-11-11","2013-11-17",46,"46/2013",{"$nulls":7},157]
[{"$nulls":169},"2013-11-18","2013-11-24",47,"47/2013",{"$nulls":7},158]
[{"$nulls":169},"2013-11-25","2013-12-01",48,"48/2013",{"$nulls":7},159]
[{"$nulls":169},"2013-12-02","2013-12-08",49,"49/2013",{"$nulls":7},160]
[{"$nulls":169},"2013-12-09","2013-12-15",50,"50/2013",{"$nulls":7},161]
[{"$nulls":169},"2013-12-16","2013-12-22",51,"51/2013",{"$nulls":7},162]
[{"$nulls":169},"2013-12-23","2013-12-29",52,"52/2013",{"$nulls":7},163]
[{"$nulls":169},"2013-12-30","2014-01-05",1,"1/2014",{"$nulls":7},164]
[{"$nulls":169},"2014-01-06","2014-01-12",2,"2/2014",{"$nulls":7},165]
[{"$nulls":169},"2014-01-13","2014-01-19",3,"3/2014",{"$nulls":7},166]
[{"$nulls":169},"2014-01-20","2014-01-26",4,"4/2014",{"$nulls":7},167]
[{"$nulls":169},"2014-01-27","2014-02-02",5,"5/2014",{"$nulls":7},168]
[{"$nulls":169},"2014-02-03","2014-02-09",6,"6/2014",{"$nulls":7},169]
[{"$nulls":169},"2014-02-10","2014-02-16",7,"7/2014",{"$nulls":7},170]
[{"$nulls":169},"2014-02-17","2014-02-23",8,"8/2014",{"$nulls":7},171]
[{"$nulls":169},"2014-02-24","2014-03-02",9,"9/2014",{"$nulls":7},172]
[{"$nulls":169},"2014-03-03","2014-03-09",10,"10/2014",{"$nulls":7},173]
[{"$nulls":169},"2014-03-10","2014-03-16",11,"11/2014",{"$nulls":7},174]
[{"$nulls":169},"2014-03-17","2014-03-23",12,"12/2014",{"$nulls":7},175]
[{"$nulls":169},"2014-03-24","2014-03-30",13,"13/2014",{"$nulls":7},176]
[{"$nulls":169},"2014-03-31","2014-04-06",14,"14/2014",{"$nulls":7},177]
[{"$nulls":169},"2014-04-07","2014-04-13",15,"15/2014",{"$nulls":7},178]
[{"$nulls":169},"2014-04-14","2014-04-20",16,"16/2014",{"$nulls":7},179]
[{"$nulls":169},"2014-04-21","2014-04-27",17,"17/2014",{"$nulls":7},180]
[{"$nulls":169},"2014-04-28","2014-05-04",18,"18/2014",{"$nulls":7},181]
[{"$nulls":169},"2014-05-05","2014-05-11",19,"19/2014",{"$nulls":7},182]
[{"$nulls":169},"2014-05-12","2014-05-18",20,"20/2014",{"$nulls":7},183]
[{"$nulls":169},"2014-05-19","2014-05-25",21,"21/2014",{"$nulls":7},184]
[{"$nulls":169},"2014-05-26","2014-06-01",22,"22/2014",{"$nulls":7},185]
[{"$nulls":169},"2014-06-02","2014-06-08",23,"23/2014",{"$nulls":7},186]
[{"$nulls":169},"2014-06-09","2014-06-15",24,"24/2014",{"$nulls":7},187]
[{"$nulls":169},"2014-06-16","2014-06-22",25,"25/2014",{"$nulls":7},188]
[{"$nulls":169},"2014-06-23","2014-06-29",26,"26/2014",{"$nulls":7},189]
[{"$nulls":169},"2014-06-30","2014-07-06",27,"27/2014",{"$nulls":7},190]
[{"$nulls":169},"2014-07-07","2014-07-13",28,"28/2014",{"$nulls":7},191]
[{"$nulls":169},"2014-07-14","2014-07-20",29,"29/2014",{"$nulls":7},192]
[{"$nulls":169},"2014-07-21","2014-07-27",30,"30/2014",{"$nulls":7},193]
[{"$nulls":169},"2014-07-28","2014-08-03",31,"31/2014",{"$nulls":7},194]
[{"$nulls":169},"2014-08-04","2014-08-10",32,"32/2014",{"$nulls":7},195]
[{"$nulls":169},"2014-08-11","2014-08-17",33,"33/2014",{"$nulls":7},196]
[{"$nulls":169},"2014-08-18","2014-08-24",34,"34/2014",{"$nulls":7},197]
[{"$nulls":169},"2014-08-25","2014-08-31",35,"35/2014",{"$nulls":7},198]
[{"$nulls":169},"2014-09-01","2014-09-07",36,"36/2014",{"$nulls":7},199]
[{"$nulls":169},"2014-09-08","2014-09-14",37,"37/2014",{"$nulls":7},200]
[{"$nulls":169},"2014-09-15","2014-09-21",38,"38/2014",{"$nulls":7},201]
[{"$nulls":169},{"$f":"FO199+1","v":"2014-09-22"},{"$f":"FN200+6","v":"2014-09-28"},39,"39/2014",{"$nulls":7},202]
[{"$nulls":169},"2014-09-29","2014-10-05",40,"40/2014",{"$nulls":7},203]
[{"$nulls":169},"2014-10-06","2014-10-12",41,"41/2014",{"$nulls":7},204]
[{"$nulls":169},"2014-10-13","2014-10-19",42,"42/2014",{"$nulls":7},205]
[{"$nulls":169},"2014-10-20","2014-10-26",43,"43/2014",{"$nulls":7},206]
[{"$nulls":169},"2014-10-27","2014-11-02",44,"44/2014",{"$nulls":7},207]
[{"$nulls":169},"2014-11-03","2014-11-09",45,"45/2014",{"$nulls":7},208]
[{"$nulls":169},"2014-11-10","2014-11-16",46,"46/2014",{"$nulls":7},209]
[{"$nulls":169},"2014-11-17","2014-11-23",47,"47/2014",{"$nulls":7},210]
[{"$nulls":169},"2014-11-24","2014-11-30",48,"48/2014",{"$nulls":7},211]
[{"$nulls":169},"2014-12-01","2014-12-07",49,"49/2014",{"$nulls":7},212]
[{"$nulls":169},"2014-12-08","2014-12-14",50,"50/2014",{"$nulls":7},213]
[{"$nulls":169},"2014-12-15","2014-12-21",51,"51/2014",{"$nulls":7},214]
[{"$nulls":169},"2014-12-22","2014-12-28",52,"52/2014",{"$nulls":7},215]
[{"$nulls":169},"2014-12-29","2015-01-04",1,"1/2015",{"$nulls":7},216]
[{"$nulls":169},"2015-01-05","2015-01-11",2,"2/2015",{"$nulls":7},217]
[{"$nulls":169},"2015-01-12","2015-01-18",3,"3/2015",{"$nulls":7},218]
[{"$nulls":169},"2015-01-19","2015-01-25",4,"4/2015",{"$nulls":7},219]
[{"$nulls":169},"2015-01-26","2015-02-01",5,"5/2015",{"$nulls":7},220]

{"sheet":"Actions","index":4,"n_rows":218,"n_cols":193,"rows_kept":218,"cut":false,"hidden":false,"merged":[[7,7,7,11],[8,7,8,11],[9,7,9,11],[10,7,10,11],[11,7,11,11],[19,7,19,11],[23,7,23,11],[25,7,25,11],[13,20,13,22],[21,7,21,11],[21,20,21,22],[15,7,15,11],[17,7,17,11],[23,20,23,22],[13,7,13,11]]}
[{"$nulls":59},"DROP DOWN MENU PAGES",{"$nulls":112},"WEEK NUMBERS",null,null,null,"SITE OR ENVIRONMENT TYPE",null,null,null,"AREAS",null,null,null,"SPACING DESCRIPTION",null,null,null,"ACTION WEEK NUMBERS",null,null,null,"NEW END WEEK NUMBERS"]
[{"$nulls":12},"Actions",{"$nulls":5},"Go to"]
[]
[{"$nulls":59},"Production stage",{"$nulls":112},"Week/Year",null,null,null,"Main area names",null,null,null,"Name",null,null,null,"Spacing description",null,null,null,"Week/Year",null,null,null,"Week/Year"]
[{"$nulls":172},"No change",null,null,null,"No change",null,null,null,"No change",null,null,null,"No change",null,null,null,"No change",null,null,null,"No change"]
[null,null,"Current  plant-batch data",{"$nulls":10},"Actions to be performed on batch during this stage",{"$nulls":45},"Data entry form",{"$nulls":112},"52/2010",null,null,null,{"$f":"IF('Data entry form'!BU6<>\"\",'Data entry form'!BU6,\"\")","v":""},{"$nulls":7},{"$f":"IF('Data entry form'!CL6<>\"\",'Data entry form'!CL6,\"\")","v":""},null,null,null,"46/2012",null,null,null,"36/2013"]
[{"$nulls":59},"Search",{"$nulls":112},"1/2011",null,null,null,{"$f":"IF('Data entry form'!BU7<>\"\",'Data entry form'!BU7,\"\")","v":""},{"$nulls":7},{"$f":"IF('Data entry form'!CL7<>\"\",'Data entry form'!CL7,\"\")","v":""},null,null,null,"47/2012",null,null,null,"37/2013"]
[null,null,"Species/variety name:",{"$nulls":10},"?",null,"Select week number for action",{"$nulls":43},"Selection",{"$nulls":112},"2/2011",null,null,null,{"$f":"IF('Data entry form'!BU8<>\"\",'Data entry form'!BU8,\"\")","v":""},{"$nulls":7},{"$f":"IF('Data entry form'!CL8<>\"\",'Data entry form'!CL8,\"\")","v":""},null,null,null,"48/2012",null,null,null,"38/2013"]
[null,null,"Unique batch code:",{"$nulls":56},"Actions",{"$nulls":112},"3/2011",null,null,null,{"$f":"IF('Data entry form'!BU9<>\"\",'Data entry form'!BU9,\"\")","v":""},{"$nulls":7},{"$f":"IF('Data entry form'!CL9<>\"\",'Data entry form'!CL9,\"\")","v":""},null,null,null,"49/2012",null,null,null,"39/2013"]
[null,null,"Production stage: ",{"$nulls":10},"?",null,"Select destination site for move",{"$nulls":43},"Actions summary",{"$nulls":112},"4/2011",null,null,null,{"$f":"IF('Data entry form'!BU10<>\"\",'Data entry form'!BU10,\"\")","v":""},{"$nulls":7},{"$f":"IF('Data entry form'!CL10<>\"\",'Data entry form'!CL10,\"\")","v":""},null,null,null,"50/2012",null,null,null,"40/2013"]
[null,null,"Stage starting week number:",{"$nulls":56},"Unique code summary",{"$nulls":112},"5/2011",null,null,null,{"$f":"IF('Data entry form'!BU11<>\"\",'Data entry form'!BU11,\"\")","v":""},{"$nulls":7},{"$f":"IF('Data entry form'!CL11<>\"\",'Data entry form'!CL11,\"\")","v":""},null,null,null,"51/2012",null,null,null,"41/2013"]
[null,null,"Stage ending week number:",{"$nulls":10},"?",null,"Select destination area for move",{"$nulls":43},"Import data",{"$nulls":112},"6/2011",null,null,null,{"$f":"IF('Data entry form'!BU12<>\"\",'Data entry form'!BU12,\"\")","v":""},{"$nulls":7},{"$f":"IF('Data entry form'!CL12<>\"\",'Data entry form'!CL12,\"\")","v":""},null,null,null,"52/2012",null,null,null,"42/2013"]
[{"$nulls":59},"Imported selection",{"$nulls":112},"7/2011",null,null,null,{"$f":"IF('Data entry form'!BU13<>\"\",'Data entry form'!BU13,\"\")","v":""},{"$nulls":7},{"$f":"IF('Data entry form'!CL13<>\"\",'Data entry form'!CL13,\"\")","v":""},null,null,null,"1/2013",null,null,null,"43/2013"]
[null,null,"Number of 'units' in batch:",{"$nulls":10},"?",null,"Number of units/batch",{"$nulls":43},"Space output",{"$nulls":112},"8/2011",null,null,null,{"$f":"IF('Data entry form'!BU14<>\"\",'Data entry form'!BU14,\"\")","v":""},{"$nulls":7},{"$f":"IF('Data entry form'!CL14<>\"\",'Data entry form'!CL14,\"\")","v":""},null,null,null,"2/2013",null,null,null,"44/2013"]
[{"$nulls":59},"Nursery summary report",{"$nulls":112},"9/2011",null,null,null,{"$f":"IF('Data entry form'!BU15<>\"\",'Data entry form'!BU15,\"\")","v":""},{"$nulls":7},{"$f":"IF('Data entry form'!CL15<>\"\",'Data entry form'!CL15,\"\")","v":""},null,null,null,"3/2013",null,null,null,"45/2013"]
[null,null,"Container type:",{"$nulls":10},"?",null,"Select batch-spacing description",{"$nulls":43},"Stage 1",{"$nulls":112},"10/2011",null,null,null,{"$f":"IF('Data entry form'!BU16<>\"\",'Data entry form'!BU16,\"\")","v":""},{"$nulls":7},{"$f":"IF('Data entry form'!CL16<>\"\",'Data entry form'!CL16,\"\")","v":""},null,null,null,"4/2013",null,null,null,"46/2013"]
[{"$nulls":59},"Final stage for sale",{"$nulls":112},"11/2011",null,null,null,{"$f":"IF('Data entry form'!BU17<>\"\",'Data entry form'!BU17,\"\")","v":""},{"$nulls":7},{"$f":"IF('Data entry form'!CL17<>\"\",'Data entry form'!CL17,\"\")","v":""},null,null,null,"5/2013",null,null,null,"47/2013"]
[null,null,"Spacing description:",{"$nulls":12},"Only for Final stage for sale ",{"$nulls":43},"Stage 2",{"$nulls":112},"12/2011",null,null,null,{"$f":"IF('Data entry form'!BU18<>\"\",'Data entry form'!BU18,\"\")","v":""},{"$nulls":7},{"$f":"IF('Data entry form'!CL18<>\"\",'Data entry form'!CL18,\"\")","v":""},null,null,null,"6/2013",null,null,null,"48/2013"]
[{"$nulls":13},"?",null,"Select new ending week-number",{"$nulls":43},"Stage 3",{"$nulls":112},"13/2011",null,null,null,{"$f":"IF('Data entry form'!BU19<>\"\",'Data entry form'!BU19,\"\")","v":""},{"$nulls":7},{"$f":"IF('Data entry form'!CL19<>\"\",'Data entry form'!CL19,\"\")","v":""},null,null,null,"7/2013",null,null,null,"49/2013"]
[null,null,"Crop density (units per m2):",{"$nulls":56},"Stage 4",{"$nulls":112},"14/2011",null,null,null,{"$f":"IF('Data entry form'!BU20<>\"\",'Data entry form'!BU20,\"\")","v":""},{"$nulls":7},{"$f":"IF('Data entry form'!CL20<>\"\",'Data entry form'!CL20,\"\")","v":""},null,null,null,"8/2013",null,null,null,"50/2013"]
[{"$nulls":59},"Stage 5",{"$nulls":112},"15/2011",null,null,null,{"$f":"IF('Data entry form'!BU21<>\"\",'Data entry form'!BU21,\"\")","v":""},{"$nulls":7},{"$f":"IF('Data entry form'!CL21<>\"\",'Data entry form'!CL21,\"\")","v":""},null,null,null,"9/2013",null,null,null,"51/2013"]
[null,null,"Batch area (m2)     ",{"$nulls":10},"Space occupied by actioned batch (m2)",{"$nulls":6},"No data",{"$nulls":38},"Stage 6",{"$nulls":112},"16/2011",null,null,null,{"$f":"IF('Data entry form'!BU22<>\"\",'Data entry form'!BU22,\"\")","v":""},{"$nulls":7},{"$f":"IF('Data entry form'!CL22<>\"\",'Data entry form'!CL22,\"\")","v":""},null,null,null,"10/2013",null,null,null,"52/2013"]
[{"$nulls":59},"Stage 7",{"$nulls":112},"17/2011",null,null,null,{"$f":"IF('Data entry form'!BU23<>\"\",'Data entry form'!BU23,\"\")","v":""},{"$nulls":7},{"$f":"IF('Data entry form'!CL23<>\"\",'Data entry form'!CL23,\"\")","v":""},null,null,null,"11/2013",null,null,null,"1/2014"]
[null,null,"Site or environment type:",{"$nulls":10},"Crop density (units per m2):",{"$nulls":6},0,{"$nulls":38},"Stage 8",{"$nulls":112},"18/2011",null,null,null,{"$f":"IF('Data entry form'!BU24<>\"\",'Data entry form'!BU24,\"\")","v":""},{"$nulls":7},{"$f":"IF('Data entry form'!CL24<>\"\",'Data entry form'!CL24,\"\")","v":""},null,null,null,"12/2013",null,null,null,"2/2014"]
[{"$nulls":59},"Stage 9",{"$nulls":112},"19/2011",null,null,null,{"$f":"IF('Data entry form'!BU25<>\"\",'Data entry form'!BU25,\"\")","v":""},{"$nulls":7},{"$f":"IF('Data entry form'!CL25<>\"\",'Data entry form'!CL25,\"\")","v":""},null,null,null,"13/2013",null,null,null,"3/2014"]
[null,null,"Area name or code:",{"$nulls":56},"Menu",{"$nulls":112},"20/2011",null,null,null,{"$f":"IF('Data entry form'!BU26<>\"\",'Data entry form'!BU26,\"\")","v":""},{"$nulls":7},{"$f":"IF('Data entry form'!CL26<>\"\",'Data entry form'!CL26,\"\")","v":""},null,null,null,"14/2013",null,null,null,"4/2014"]
[{"$nulls":59},"User guide",{"$nulls":112},"21/2011",null,null,null,{"$f":"IF('Data entry form'!BU27<>\"\",'Data entry form'!BU27,\"\")","v":""},{"$nulls":7},{"$f":"IF('Data entry form'!CL27<>\"\",'Data entry form'!CL27,\"\")","v":""},null,null,null,"15/2013",null,null,null,"5/2014"]
[{"$nulls":59},"Contact us",{"$nulls":112},"22/2011",null,null,null,{"$f":"IF('Data entry form'!BU28<>\"\",'Data entry form'!BU28,\"\")","v":""},{"$nulls":7},{"$f":"IF('Data entry form'!CL28<>\"\",'Data entry form'!CL28,\"\")","v":""},null,null,null,"16/2013",null,null,null,"6/2014"]
[{"$nulls":59},"Nursery details",{"$nulls":112},"23/2011",null,null,null,{"$f":"IF('Data entry form'!BU29<>\"\",'Data entry form'!BU29,\"\")","v":""},{"$nulls":7},{"$f":"IF('Data entry form'!CL29<>\"\",'Data entry form'!CL29,\"\")","v":""},null,null,null,"17/2013",null,null,null,"7/2014"]
[{"$nulls":172},"24/2011",null,null,null,{"$f":"IF('Data entry form'!BU30<>\"\",'Data entry form'!BU30,\"\")","v":""},{"$nulls":7},{"$f":"IF('Data entry form'!CL30<>\"\",'Data entry form'!CL30,\"\")","v":""},null,null,null,"18/2013",null,null,null,"8/2014"]
[{"$nulls":172},"25/2011",null,null,null,{"$f":"IF('Data entry form'!BU31<>\"\",'Data entry form'!BU31,\"\")","v":""},{"$nulls":7},{"$f":"IF('Data entry form'!CL31<>\"\",'Data entry form'!CL31,\"\")","v":""},null,null,null,"19/2013",null,null,null,"9/2014"]
[{"$nulls":172},"26/2011",null,null,null,{"$f":"IF('Data entry form'!BU32<>\"\",'Data entry form'!BU32,\"\")","v":""},{"$nulls":7},{"$f":"IF('Data entry form'!CL32<>\"\",'Data entry form'!CL32,\"\")","v":""},null,null,null,"20/2013",null,null,null,"10/2014"]
[{"$nulls":172},"27/2011",null,null,null,{"$f":"IF('Data entry form'!BU33<>\"\",'Data entry form'!BU33,\"\")","v":""},{"$nulls":7},{"$f":"IF('Data entry form'!CL33<>\"\",'Data entry form'!CL33,\"\")","v":""},null,null,null,"21/2013",null,null,null,"11/2014"]
[{"$nulls":172},"28/2011",null,null,null,{"$f":"IF('Data entry form'!BU34<>\"\",'Data entry form'!BU34,\"\")","v":""},{"$nulls":7},{"$f":"IF('Data entry form'!CL34<>\"\",'Data entry form'!CL34,\"\")","v":""},null,null,null,"22/2013",null,null,null,"12/2014"]
[{"$nulls":172},"29/2011",null,null,null,{"$f":"IF('Data entry form'!BU35<>\"\",'Data entry form'!BU35,\"\")","v":""},{"$nulls":7},{"$f":"IF('Data entry form'!CL35<>\"\",'Data entry form'!CL35,\"\")","v":""},null,null,null,"23/2013",null,null,null,"13/2014"]
[{"$nulls":172},"30/2011",null,null,null,{"$f":"IF('Data entry form'!BU36<>\"\",'Data entry form'!BU36,\"\")","v":""},{"$nulls":7},{"$f":"IF('Data entry form'!CL36<>\"\",'Data entry form'!CL36,\"\")","v":""},null,null,null,"24/2013",null,null,null,"14/2014"]
[{"$nulls":172},"31/2011",null,null,null,{"$f":"IF('Data entry form'!BU37<>\"\",'Data entry form'!BU37,\"\")","v":""},{"$nulls":7},{"$f":"IF('Data entry form'!CL37<>\"\",'Data entry form'!CL37,\"\")","v":""},null,null,null,"25/2013",null,null,null,"15/2014"]
[{"$nulls":172},"32/2011",null,null,null,{"$f":"IF('Data entry form'!BU38<>\"\",'Data entry form'!BU38,\"\")","v":""},{"$nulls":7},{"$f":"IF('Data entry form'!CL38<>\"\",'Data entry form'!CL38,\"\")","v":""},null,null,null,"26/2013",null,null,null,"16/2014"]
[{"$nulls":172},"33/2011",null,null,null,{"$f":"IF('Data entry form'!BU39<>\"\",'Data entry form'!BU39,\"\")","v":""},{"$nulls":7},{"$f":"IF('Data entry form'!CL39<>\"\",'Data entry form'!CL39,\"\")","v":""},null,null,null,"27/2013",null,null,null,"17/2014"]
[{"$nulls":172},"34/2011",null,null,null,{"$f":"IF('Data entry form'!BU40<>\"\",'Data entry form'!BU40,\"\")","v":""},{"$nulls":7},{"$f":"IF('Data entry form'!CL40<>\"\",'Data entry form'!CL40,\"\")","v":""},null,null,null,"28/2013",null,null,null,"18/2014"]
[{"$nulls":172},"35/2011",null,null,null,{"$f":"IF('Data entry form'!BU41<>\"\",'Data entry form'!BU41,\"\")","v":""},{"$nulls":7},{"$f":"IF('Data entry form'!CL41<>\"\",'Data entry form'!CL41,\"\")","v":""},null,null,null,"29/2013",null,null,null,"19/2014"]
[{"$nulls":172},"36/2011",null,null,null,{"$f":"IF('Data entry form'!BU42<>\"\",'Data entry form'!BU42,\"\")","v":""},{"$nulls":7},{"$f":"IF('Data entry form'!CL42<>\"\",'Data entry form'!CL42,\"\")","v":""},null,null,null,"30/2013",null,null,null,"20/2014"]
[{"$nulls":172},"37/2011",null,null,null,{"$f":"IF('Data entry form'!BU43<>\"\",'Data entry form'!BU43,\"\")","v":""},{"$nulls":7},{"$f":"IF('Data entry form'!CL43<>\"\",'Data entry form'!CL43,\"\")","v":""},null,null,null,"31/2013",null,null,null,"21/2014"]
[{"$nulls":172},"38/2011",null,null,null,{"$f":"IF('Data entry form'!BU44<>\"\",'Data entry form'!BU44,\"\")","v":""},{"$nulls":7},{"$f":"IF('Data entry form'!CL44<>\"\",'Data entry form'!CL44,\"\")","v":""},null,null,null,"32/2013",null,null,null,"22/2014"]
[{"$nulls":172},"39/2011",null,null,null,{"$f":"IF('Data entry form'!BU45<>\"\",'Data entry form'!BU45,\"\")","v":""},{"$nulls":7},{"$f":"IF('Data entry form'!CL45<>\"\",'Data entry form'!CL45,\"\")","v":""},null,null,null,"33/2013",null,null,null,"23/2014"]
[{"$nulls":172},"40/2011",null,null,null,{"$f":"IF('Data entry form'!BU46<>\"\",'Data entry form'!BU46,\"\")","v":""},{"$nulls":7},{"$f":"IF('Data entry form'!CL46<>\"\",'Data entry form'!CL46,\"\")","v":""},null,null,null,"34/2013",null,null,null,"24/2014"]
[{"$nulls":172},"41/2011",null,null,null,{"$f":"IF('Data entry form'!BU47<>\"\",'Data entry form'!BU47,\"\")","v":""},{"$nulls":7},{"$f":"IF('Data entry form'!CL47<>\"\",'Data entry form'!CL47,\"\")","v":""},null,null,null,"35/2013",null,null,null,"25/2014"]
[{"$nulls":172},"42/2011",null,null,null,{"$f":"IF('Data entry form'!BU48<>\"\",'Data entry form'!BU48,\"\")","v":""},{"$nulls":7},{"$f":"IF('Data entry form'!CL48<>\"\",'Data entry form'!CL48,\"\")","v":""},null,null,null,"",null,null,null,"26/2014"]
[{"$nulls":172},"43/2011",null,null,null,{"$f":"IF('Data entry form'!BU49<>\"\",'Data entry form'!BU49,\"\")","v":""},{"$nulls":7},{"$f":"IF('Data entry form'!CL49<>\"\",'Data entry form'!CL49,\"\")","v":""},null,null,null,"",null,null,null,"27/2014"]
[{"$nulls":172},"44/2011",null,null,null,{"$f":"IF('Data entry form'!BU50<>\"\",'Data entry form'!BU50,\"\")","v":""},{"$nulls":7},{"$f":"IF('Data entry form'!CL50<>\"\",'Data entry form'!CL50,\"\")","v":""},null,null,null,"",null,null,null,"28/2014"]
[{"$nulls":172},"45/2011",null,null,null,{"$f":"IF('Data entry form'!BU51<>\"\",'Data entry form'!BU51,\"\")","v":""},{"$nulls":7},{"$f":"IF('Data entry form'!CL51<>\"\",'Data entry form'!CL51,\"\")","v":""},null,null,null,"",null,null,null,"29/2014"]
[{"$nulls":172},"46/2011",null,null,null,{"$f":"IF('Data entry form'!BU52<>\"\",'Data entry form'!BU52,\"\")","v":""},{"$nulls":7},{"$f":"IF('Data entry form'!CL52<>\"\",'Data entry form'!CL52,\"\")","v":""},null,null,null,"",null,null,null,"30/2014"]
[{"$nulls":172},"47/2011",null,null,null,{"$f":"IF('Data entry form'!BU53<>\"\",'Data entry form'!BU53,\"\")","v":""},{"$nulls":7},{"$f":"IF('Data entry form'!CL53<>\"\",'Data entry form'!CL53,\"\")","v":""},null,null,null,"",null,null,null,"31/2014"]
[{"$nulls":172},"48/2011",null,null,null,{"$f":"IF('Data entry form'!BU54<>\"\",'Data entry form'!BU54,\"\")","v":""},{"$nulls":7},{"$f":"IF('Data entry form'!CL54<>\"\",'Data entry form'!CL54,\"\")","v":""},null,null,null,"",null,null,null,"32/2014"]
[{"$nulls":172},"49/2011",null,null,null,{"$f":"IF('Data entry form'!BU55<>\"\",'Data entry form'!BU55,\"\")","v":""},{"$nulls":7},{"$f":"IF('Data entry form'!CL55<>\"\",'Data entry form'!CL55,\"\")","v":""},null,null,null,"",null,null,null,"33/2014"]
[{"$nulls":172},"50/2011",null,null,null,{"$f":"IF('Data entry form'!BU56<>\"\",'Data entry form'!BU56,\"\")","v":""},{"$nulls":7},{"$f":"IF('Data entry form'!CL56<>\"\",'Data entry form'!CL56,\"\")","v":""},null,null,null,"",null,null,null,"34/2014"]
[{"$nulls":172},"51/2011",null,null,null,{"$f":"IF('Data entry form'!BU57<>\"\",'Data entry form'!BU57,\"\")","v":""},{"$nulls":7},{"$f":"IF('Data entry form'!CL57<>\"\",'Data entry form'!CL57,\"\")","v":""},null,null,null,"",null,null,null,"35/2014"]
[{"$nulls":172},"52/2011",null,null,null,{"$f":"IF('Data entry form'!BU58<>\"\",'Data entry form'!BU58,\"\")","v":""},{"$nulls":7},{"$f":"IF('Data entry form'!CL58<>\"\",'Data entry form'!CL58,\"\")","v":""},null,null,null,"",null,null,null,"36/2014"]
[{"$nulls":172},"53/2011",null,null,null,{"$f":"IF('Data entry form'!BU59<>\"\",'Data entry form'!BU59,\"\")","v":""},{"$nulls":7},{"$f":"IF('Data entry form'!CL59<>\"\",'Data entry form'!CL59,\"\")","v":""},null,null,null,"",null,null,null,"37/2014"]
[{"$nulls":172},"1/2012",{"$nulls":15},"",null,null,null,"38/2014"]
[{"$nulls":172},"2/2012",{"$nulls":15},"",null,null,null,"39/2014"]
[{"$nulls":172},"3/2012",{"$nulls":15},"",null,null,null,"40/2014"]
[{"$nulls":172},"4/2012",{"$nulls":15},"",null,null,null,"41/2014"]
[{"$nulls":172},"5/2012",{"$nulls":15},"",null,null,null,"42/2014"]
[{"$nulls":172},"6/2012",{"$nulls":15},"",null,null,null,"43/2014"]
[{"$nulls":172},"7/2012",{"$nulls":15},"",null,null,null,"44/2014"]
[{"$nulls":172},"8/2012",{"$nulls":15},"",null,null,null,"45/2014"]
[{"$nulls":172},"9/2012",{"$nulls":15},"",null,null,null,"46/2014"]
[{"$nulls":172},"10/2012",{"$nulls":15},"",null,null,null,"47/2014"]
[{"$nulls":172},"11/2012",{"$nulls":15},"",null,null,null,"48/2014"]
[{"$nulls":172},"12/2012",{"$nulls":15},"",null,null,null,"49/2014"]
[{"$nulls":172},"13/2012",{"$nulls":15},"",null,null,null,"50/2014"]
[{"$nulls":172},"14/2012",{"$nulls":15},"",null,null,null,"51/2014"]
[{"$nulls":172},"15/2012",{"$nulls":15},"",null,null,null,"52/2014"]
[{"$nulls":172},"16/2012",{"$nulls":15},"",null,null,null,"1/2015"]
[{"$nulls":172},"17/2012",{"$nulls":15},"",null,null,null,"2/2015"]
[{"$nulls":172},"18/2012",{"$nulls":15},"",null,null,null,"3/2015"]
[{"$nulls":172},"19/2012",{"$nulls":15},"",null,null,null,"4/2015"]
[{"$nulls":172},"20/2012",{"$nulls":15},"",null,null,null,"5/2015"]
[{"$nulls":172},"21/2012",{"$nulls":15},"",null,null,null,""]
[{"$nulls":172},"22/2012",{"$nulls":15},"",null,null,null,""]
[{"$nulls":172},"23/2012",{"$nulls":15},"",null,null,null,""]
[{"$nulls":172},"24/2012",{"$nulls":15},"",null,null,null,""]
[{"$nulls":172},"25/2012",{"$nulls":15},"",null,null,null,""]
[{"$nulls":172},"26/2012",{"$nulls":15},"",null,null,null,""]
[{"$nulls":172},"27/2012",{"$nulls":15},"",null,null,null,""]
[{"$nulls":172},"28/2012",{"$nulls":15},"",null,null,null,""]
[{"$nulls":172},"29/2012",{"$nulls":15},"",null,null,null,""]
[{"$nulls":172},"30/2012",{"$nulls":15},"",null,null,null,""]
[{"$nulls":172},"31/2012",{"$nulls":15},"",null,null,null,""]
[{"$nulls":172},"32/2012",{"$nulls":15},"",null,null,null,""]
[{"$nulls":172},"33/2012",{"$nulls":15},"",null,null,null,""]
[{"$nulls":172},"34/2012",{"$nulls":15},"",null,null,null,""]
[{"$nulls":172},"35/2012",{"$nulls":15},"",null,null,null,""]
[{"$nulls":172},"36/2012",{"$nulls":15},"",null,null,null,""]
[{"$nulls":172},"37/2012",{"$nulls":15},"",null,null,null,""]
[{"$nulls":172},"38/2012",{"$nulls":15},"",null,null,null,""]
[{"$nulls":172},"39/2012",{"$nulls":15},"",null,null,null,""]
[{"$nulls":172},"40/2012",{"$nulls":15},"",null,null,null,""]
[{"$nulls":172},"41/2012",{"$nulls":15},"",null,null,null,""]
[{"$nulls":172},"42/2012",{"$nulls":15},"",null,null,null,""]
[{"$nulls":172},"43/2012",{"$nulls":15},"",null,null,null,""]
[{"$nulls":172},"44/2012",{"$nulls":15},"",null,null,null,""]
[{"$nulls":172},"45/2012",{"$nulls":15},"",null,null,null,""]
[{"$nulls":172},"46/2012",{"$nulls":15},"",null,null,null,""]
[{"$nulls":172},"47/2012",{"$nulls":15},"",null,null,null,""]
[{"$nulls":172},"48/2012",{"$nulls":15},"",null,null,null,""]
[{"$nulls":172},"49/2012",{"$nulls":15},"",null,null,null,""]
[{"$nulls":172},"50/2012",{"$nulls":15},"",null,null,null,""]
[{"$nulls":172},"51/2012",{"$nulls":15},"",null,null,null,""]
[{"$nulls":172},"52/2012",{"$nulls":15},"",null,null,null,""]
[{"$nulls":172},"1/2013",{"$nulls":15},"",null,null,null,""]
[{"$nulls":172},"2/2013",{"$nulls":15},"",null,null,null,""]
[{"$nulls":172},"3/2013",{"$nulls":15},"",null,null,null,""]
[{"$nulls":172},"4/2013",{"$nulls":15},"",null,null,null,""]
[{"$nulls":172},"5/2013",{"$nulls":15},"",null,null,null,""]
[{"$nulls":172},"6/2013",{"$nulls":15},"",null,null,null,""]
[{"$nulls":172},"7/2013",{"$nulls":15},"",null,null,null,""]
[{"$nulls":172},"8/2013",{"$nulls":15},"",null,null,null,""]
[{"$nulls":172},"9/2013",{"$nulls":15},"",null,null,null,""]
[{"$nulls":172},"10/2013",{"$nulls":15},"",null,null,null,""]
[{"$nulls":172},"11/2013",{"$nulls":15},"",null,null,null,""]
[{"$nulls":172},"12/2013",{"$nulls":15},"",null,null,null,""]
[{"$nulls":172},"13/2013",{"$nulls":15},"",null,null,null,""]
[{"$nulls":172},"14/2013",{"$nulls":15},"",null,null,null,""]
[{"$nulls":172},"15/2013",{"$nulls":15},"",null,null,null,""]
[{"$nulls":172},"16/2013",{"$nulls":15},"",null,null,null,""]
[{"$nulls":172},"17/2013",{"$nulls":15},"",null,null,null,""]
[{"$nulls":172},"18/2013",{"$nulls":15},"",null,null,null,""]
[{"$nulls":172},"19/2013",{"$nulls":15},"",null,null,null,""]
[{"$nulls":172},"20/2013",{"$nulls":15},"",null,null,null,""]
[{"$nulls":172},"21/2013",{"$nulls":15},"",null,null,null,""]
[{"$nulls":172},"22/2013",{"$nulls":15},"",null,null,null,""]
[{"$nulls":172},"23/2013",{"$nulls":15},"",null,null,null,""]
[{"$nulls":172},"24/2013",{"$nulls":15},"",null,null,null,""]
[{"$nulls":172},"25/2013",{"$nulls":15},"",null,null,null,""]
[{"$nulls":172},"26/2013",{"$nulls":15},"",null,null,null,""]
[{"$nulls":172},"27/2013",{"$nulls":15},"",null,null,null,""]
[{"$nulls":172},"28/2013",{"$nulls":15},"",null,null,null,""]
[{"$nulls":172},"29/2013",{"$nulls":15},"",null,null,null,""]
[{"$nulls":172},"30/2013",{"$nulls":15},"",null,null,null,""]
[{"$nulls":172},"31/2013",{"$nulls":15},"",null,null,null,""]
[{"$nulls":172},"32/2013",{"$nulls":15},"",null,null,null,""]
[{"$nulls":172},"33/2013",{"$nulls":15},"",null,null,null,""]
[{"$nulls":172},"34/2013",{"$nulls":15},"",null,null,null,""]
[{"$nulls":172},"35/2013",{"$nulls":15},"",null,null,null,""]
[{"$nulls":172},"36/2013",{"$nulls":15},"",null,null,null,""]
[{"$nulls":172},"37/2013",{"$nulls":15},"",null,null,null,""]
[{"$nulls":172},"38/2013",{"$nulls":15},"",null,null,null,""]
[{"$nulls":172},"39/2013",{"$nulls":15},"",null,null,null,""]
[{"$nulls":172},"40/2013",{"$nulls":15},"",null,null,null,""]
[{"$nulls":172},"41/2013",{"$nulls":15},"",null,null,null,""]
[{"$nulls":172},"42/2013",{"$nulls":15},"",null,null,null,""]
[{"$nulls":172},"43/2013",{"$nulls":15},"",null,null,null,""]
[{"$nulls":172},"44/2013",{"$nulls":15},"",null,null,null,""]
[{"$nulls":172},"45/2013",{"$nulls":15},"",null,null,null,""]
[{"$nulls":172},"46/2013",{"$nulls":15},"",null,null,null,""]
[{"$nulls":172},"47/2013",{"$nulls":15},"",null,null,null,""]
[{"$nulls":172},"48/2013",{"$nulls":15},"",null,null,null,""]
[{"$nulls":172},"49/2013",{"$nulls":15},"",null,null,null,""]
[{"$nulls":172},"50/2013",{"$nulls":15},"",null,null,null,""]
[{"$nulls":172},"51/2013",{"$nulls":15},"",null,null,null,""]
[{"$nulls":172},"52/2013",{"$nulls":15},"",null,null,null,""]
[{"$nulls":172},"1/2014",{"$nulls":15},"",null,null,null,""]
[{"$nulls":172},"2/2014",{"$nulls":15},"",null,null,null,""]
[{"$nulls":172},"3/2014",{"$nulls":15},"",null,null,null,""]
[{"$nulls":172},"4/2014",{"$nulls":15},"",null,null,null,""]
[{"$nulls":172},"5/2014",{"$nulls":15},"",null,null,null,""]
[{"$nulls":172},"6/2014",{"$nulls":15},"",null,null,null,""]
[{"$nulls":172},"7/2014",{"$nulls":15},"",null,null,null,""]
[{"$nulls":172},"8/2014",{"$nulls":15},"",null,null,null,""]
[{"$nulls":172},"9/2014",{"$nulls":15},"",null,null,null,""]
[{"$nulls":172},"10/2014",{"$nulls":15},"",null,null,null,""]
[{"$nulls":172},"11/2014",{"$nulls":15},"",null,null,null,""]
[{"$nulls":172},"12/2014",{"$nulls":15},"",null,null,null,""]
[{"$nulls":172},"13/2014",{"$nulls":15},"",null,null,null,""]
[{"$nulls":172},"14/2014",{"$nulls":15},"",null,null,null,""]
[{"$nulls":172},"15/2014",{"$nulls":15},"",null,null,null,""]
[{"$nulls":172},"16/2014",{"$nulls":15},"",null,null,null,""]
[{"$nulls":172},"17/2014",{"$nulls":15},"",null,null,null,""]
[{"$nulls":172},"18/2014",{"$nulls":15},"",null,null,null,""]
[{"$nulls":172},"19/2014",{"$nulls":15},"",null,null,null,""]
[{"$nulls":172},"20/2014",{"$nulls":15},"",null,null,null,""]
[{"$nulls":172},"21/2014",{"$nulls":15},"",null,null,null,""]
[{"$nulls":172},"22/2014",{"$nulls":15},"",null,null,null,""]
[{"$nulls":172},"23/2014",{"$nulls":15},"",null,null,null,""]
[{"$nulls":172},"24/2014",{"$nulls":15},"",null,null,null,""]
[{"$nulls":172},"25/2014",{"$nulls":15},"",null,null,null,""]
[{"$nulls":172},"26/2014",{"$nulls":15},"",null,null,null,""]
[{"$nulls":172},"27/2014",{"$nulls":15},"",null,null,null,""]
[{"$nulls":172},"28/2014",{"$nulls":15},"",null,null,null,""]
[{"$nulls":172},"29/2014",{"$nulls":15},"",null,null,null,""]
[{"$nulls":172},"30/2014",{"$nulls":15},"",null,null,null,""]
[{"$nulls":172},"31/2014",{"$nulls":15},"",null,null,null,""]
[{"$nulls":172},"32/2014",{"$nulls":15},"",null,null,null,""]
[{"$nulls":172},"33/2014",{"$nulls":15},"",null,null,null,""]
[{"$nulls":172},"34/2014",{"$nulls":15},"",null,null,null,""]
[{"$nulls":172},"35/2014",{"$nulls":15},"",null,null,null,""]
[{"$nulls":172},"36/2014",{"$nulls":15},"",null,null,null,""]
[{"$nulls":172},"37/2014",{"$nulls":15},"",null,null,null,""]
[{"$nulls":172},"38/2014",{"$nulls":15},"",null,null,null,""]
[{"$nulls":172},"39/2014",{"$nulls":15},"",null,null,null,""]
[{"$nulls":172},"40/2014",{"$nulls":15},"",null,null,null,""]
[{"$nulls":172},"41/2014",{"$nulls":15},"",null,null,null,""]
[{"$nulls":172},"42/2014",{"$nulls":15},"",null,null,null,""]
[{"$nulls":172},"43/2014",{"$nulls":15},"",null,null,null,""]
[{"$nulls":172},"44/2014",{"$nulls":15},"",null,null,null,""]
[{"$nulls":172},"45/2014",{"$nulls":15},"",null,null,null,""]
[{"$nulls":172},"46/2014",{"$nulls":15},"",null,null,null,""]
[{"$nulls":172},"47/2014",{"$nulls":15},"",null,null,null,""]
[{"$nulls":172},"48/2014",{"$nulls":15},"",null,null,null,""]
[{"$nulls":172},"49/2014",{"$nulls":15},"",null,null,null,""]
[{"$nulls":172},"50/2014",{"$nulls":15},"",null,null,null,""]
[{"$nulls":172},"51/2014",{"$nulls":15},"",null,null,null,""]
[{"$nulls":172},"52/2014",{"$nulls":15},"",null,null,null,""]
[{"$nulls":172},"1/2015",{"$nulls":15},"",null,null,null,""]
[{"$nulls":172},"2/2015",{"$nulls":15},"",null,null,null,""]
[{"$nulls":172},"3/2015",{"$nulls":15},"",null,null,null,""]

{"sheet":"Actions summary","index":5,"n_rows":29,"n_cols":60,"rows_kept":29,"cut":false,"hidden":false,"merged":[]}
[{"$nulls":59},"DROP DOWN MENU PAGES"]
[{"$nulls":9}," Actions summary"]
[{"$nulls":13},"Go to"]
[{"$nulls":59},"Production stage"]
[]
[{"$nulls":59},"Data entry form"]
[{"$nulls":59},"Search"]
[{"$nulls":4},"Identifiers",null,"Achillea Summer Pastals",null,null,null,"Ach.Sum-Plu-F-46/2012-1",{"$nulls":48},"Selection"]
[{"$nulls":59},"Actions"]
[{"$nulls":59},"Actions summary"]
[{"$nulls":6},"Initial conditions",null,"Action 1",null,"Action 2",null,"Action 3",null,"Action 4",null,"Action 5",{"$nulls":42},"Unique code summary"]
[{"$nulls":59},"Import data"]
[{"$nulls":59},"Imported selection"]
[{"$nulls":4},"Week number of action",{"$nulls":54},"Space output"]
[{"$nulls":4},"Production stage",{"$nulls":54},"Nursery summary report"]
[{"$nulls":4},"Site or environment type",{"$nulls":54},"Stage 1"]
[{"$nulls":4},"Area name or code",{"$nulls":54},"Final stage for sale"]
[{"$nulls":4},"Number of units/batch",{"$nulls":54},"Stage 2"]
[{"$nulls":4},"Batch-spacing description",{"$nulls":54},"Stage 3"]
[{"$nulls":4},"Crop density (units per m2)",{"$nulls":54},"Stage 4"]
[{"$nulls":4},"Area occupied by batch (m2)",{"$nulls":54},"Stage 5"]
[{"$nulls":59},"Stage 6"]
[{"$nulls":4},"For \"Final stage for sale\" only ",{"$nulls":54},"Stage 7"]
[{"$nulls":4},"Extension ending week-number",{"$nulls":54},"Stage 8"]
[{"$nulls":59},"Stage 9"]
[{"$nulls":59},"Menu"]
[{"$nulls":59},"User guide"]
[{"$nulls":59},"Contact us"]
[{"$nulls":59},"Nursery details"]

{"sheet":"Unique code summary","index":6,"n_rows":133,"n_cols":60,"rows_kept":133,"cut":false,"hidden":false,"merged":[]}
[{"$nulls":59},"DROP DOWN MENU PAGES"]
[{"$nulls":9},"Unique code summary"]
[{"$nulls":14},"Go to"]
[{"$nulls":59},"Production stage"]
[]
[null,null,"Current  plant-batch data (Any information highlighted in blue indicates Actions carried out within the production stages)",{"$nulls":56},"Data entry form"]
[{"$nulls":59},"Search"]
[null,null,"Species/variety name:",{"$nulls":56},"Selection"]
[null,null,"Unique batch code:",{"$nulls":56},"Actions"]
[{"$nulls":59},"Actions summary"]
[null,null,"Production stage: ",{"$nulls":56},"Unique code summary"]
[null,null,"Actions week number:",{"$nulls":56},"Import data"]
[null,null,"Stage starting week number:",{"$nulls":56},"Imported selection"]
[null,null,"Stage ending week number:",{"$nulls":56},"Space output"]
[null,null,"Number of 'units' in batch:",{"$nulls":56},"Nursery summary report"]
[null,null,"Container type:",{"$nulls":56},"Stage 1"]
[null,null,"Spacing description:",{"$nulls":56},"Final stage for sale"]
[null,null,"Crop density (units per m2):",{"$nulls":56},"Stage 2"]
[null,null,"Batch area (m2)     ",{"$nulls":56},"Stage 3"]
[null,null,"Site or environment type:",{"$nulls":56},"Stage 4"]
[null,null,"Area name or code:",{"$nulls":56},"Stage 5"]
[null,null,"New ending week-number:",{"$nulls":56},"Stage 6"]
[{"$nulls":59},"Stage 7"]
[{"$nulls":59},"Stage 8"]
[{"$nulls":59},"Stage 9"]
[{"$nulls":59},"Menu"]
[{"$nulls":59},"User guide"]
[{"$nulls":59},"Contact us"]
[{"$nulls":59},"Nursery details"]
{"$rows_empty":71}
[null,null,"Production stage: ",null,null,null,{"$f":"G11","v":0},null,{"$f":"I11","v":0},null,{"$f":"K11","v":0},null,{"$f":"M11","v":0},null,{"$f":"O11","v":0},null,{"$f":"Q11","v":0},null,{"$f":"S11","v":0},null,{"$f":"U11","v":0},null,{"$f":"W11","v":0},null,{"$f":"Y11","v":0},null,{"$f":"AA11","v":0},null,{"$f":"AC11","v":0},null,{"$f":"AE11","v":0},null,{"$f":"AG11","v":0},null,{"$f":"AI11","v":0},null,{"$f":"AK11","v":0}]
[null,null,"Actions week number:",null,null,null,{"$f":"G12","v":0},null,0,null,0,null,0,null,0,null,0,null,0,null,0,null,0,null,0,null,0,null,0,null,0,null,0,null,0,null,0]
[null,null,"Stage starting week number:",null,null,null,0,null,0,null,0,null,0,null,0,null,0,null,0,null,0,null,0,null,0,null,0,null,0,null,0,null,0,null,0,null,0]
[null,null,"Stage ending week number:",null,null,null,0,null,0,null,0,null,0,null,0,null,0,null,0,null,0,null,0,null,0,null,0,null,0,null,0,null,0,null,0,null,0]
[null,null,"Number of 'units' in batch:",null,null,null,0,null,0,null,0,null,0,null,0,null,0,null,0,null,0,null,0,null,0,null,0,null,0,null,0,null,0,null,0,null,0]
[null,null,"Container type:",null,null,null,0,null,0,null,0,null,0,null,0,null,0,null,0,null,0,null,0,null,0,null,0,null,0,null,0,null,0,null,0,null,0]
[null,null,"Spacing description:",null,null,null,0,null,0,null,0,null,0,null,0,null,0,null,0,null,0,null,0,null,0,null,0,null,0,null,0,null,0,null,0,null,0]
[null,null,"Crop density (units per m2):",null,null,null,0,null,0,null,0,null,0,null,0,null,0,null,0,null,0,null,0,null,0,null,0,null,0,null,0,null,0,null,0,null,0]
[null,null,"Batch area (m2)     ",null,null,null,0,null,0,null,0,null,0,null,0,null,0,null,0,null,0,null,0,null,0,null,0,null,0,null,0,null,0,null,0,null,0]
[null,null,"Site or environment type:",null,null,null,0,null,0,null,0,null,0,null,0,null,0,null,0,null,0,null,0,null,0,null,0,null,0,null,0,null,0,null,0,null,0]
[null,null,"Area name or code:",null,null,null,0,null,0,null,0,null,0,null,0,null,0,null,0,null,0,null,0,null,0,null,0,null,0,null,0,null,0,null,0,null,0]
[null,null,"New ending week-number:",null,null,null,0,null,0,null,0,null,0,null,0,null,0,null,0,null,0,null,0,null,0,null,0,null,0,null,0,null,0,null,0,null,0]
[null,null,"Actual week starting number"]
[null,null,"Actual ending week number"]
[]
[]
[]
[null,null,"Stage","Start","Stop","m2","Site","Area name"]
[null,1,"Stage 1",113,126,1,"Main","GH2"]
[null,2]
[null,3]
[null,4]
[null,5]
[null,6]
[null,7]
[null,8]
[null,9]
[null,10]
[null,11]
[null,12]
[null,13]
[null,14]
[null,15]

{"sheet":"Search","index":7,"n_rows":57,"n_cols":100,"rows_kept":57,"cut":false,"hidden":false,"merged":[[6,10,6,12],[10,10,10,12],[20,10,20,12],[14,10,14,12],[16,6,16,8],[16,10,16,12],[18,10,18,12]]}
[{"$nulls":59},"DROP DOWN MENU PAGES",{"$nulls":4},"OVERWRITE CHOICE",null,null,null,"Range names",{"$nulls":16},"CONTAINER DATA Entered on Data Entry Form",{"$nulls":4},"SITE OR ENVIRONMENT TYPE",null,null,null,"AREAS WITHIN THE SITE",null,null,null,"ComboBox contents"]
[{"$nulls":6},"           Search"]
[{"$nulls":9},"Go to"]
[{"$nulls":59},"Production stage",{"$nulls":4},"Choice",null,null,null,"Production stage",{"$nulls":16},"Pot or tray types","Product units",null,null,null,"Main area names",null,null,null,"Name",null,null,null,"Name","Selection"]
[{"$nulls":68},"Stage 2",{"$nulls":16},"No selection",{"$f":"IF('Data entry form'!CH5<>0,'Data entry form'!CH5,\"\")","v":""},null,null,null,"No selection",null,null,null,"No selection",null,null,null,1,"No selection"]
[{"$nulls":59},"Data entry form",{"$nulls":4},"Yes",null,null,null,"Stage 3",{"$nulls":16},{"$f":"IF('Data entry form'!CG6<>\"\",'Data entry form'!CG6,\"\")","v":""},{"$f":"IF('Data entry form'!CH6<>0,'Data entry form'!CH6,\"\")","v":""},null,null,null,{"$f":"IF('Data entry form'!BU6<>\"\",'Data entry form'!BU6,\"\")","v":""},{"$nulls":7},3,"No selection"]
[null,null,"?",null,"Search start period (dd/mm/yyyy):  From",null,null,"to",null,null,{"$f":"IF(AND(G7=\"\",I7=\"\"),\"Consider entering search dates?\",IF(G7=\"\",\"Consider entering a start date?\",IF(I7=\"\",\"Consider entering an end date?\",\"Okay\")))","v":"Consider entering search dates?"},{"$nulls":48},"Search",{"$nulls":4},"No",null,null,null,"Stage 4",{"$nulls":16},{"$f":"IF('Data entry form'!CG7<>\"\",'Data entry form'!CG7,\"\")","v":""},{"$f":"IF('Data entry form'!CH7<>0,'Data entry form'!CH7,\"\")","v":""},null,null,null,{"$f":"IF('Data entry form'!BU7<>\"\",'Data entry form'!BU7,\"\")","v":""},{"$nulls":7},4,"No selection"]
[{"$nulls":59},"Selection",{"$nulls":8},"Stage 5",{"$nulls":16},{"$f":"IF('Data entry form'!CG8<>\"\",'Data entry form'!CG8,\"\")","v":""},{"$f":"IF('Data entry form'!CH8<>0,'Data entry form'!CH8,\"\")","v":""},null,null,null,{"$f":"IF('Data entry form'!BU8<>\"\",'Data entry form'!BU8,\"\")","v":""}]
[null,null,"?",{"$nulls":56},"Actions",{"$nulls":8},"Stage 6",{"$nulls":16},{"$f":"IF('Data entry form'!CG9<>\"\",'Data entry form'!CG9,\"\")","v":""},{"$f":"IF('Data entry form'!CH9<>0,'Data entry form'!CH9,\"\")","v":""},null,null,null,{"$f":"IF('Data entry form'!BU9<>\"\",'Data entry form'!BU9,\"\")","v":""}]
[{"$nulls":59},"Actions summary",{"$nulls":8},"Stage 7",{"$nulls":16},{"$f":"IF('Data entry form'!CG10<>\"\",'Data entry form'!CG10,\"\")","v":""},{"$f":"IF('Data entry form'!CH10<>0,'Data entry form'!CH10,\"\")","v":""},null,null,null,{"$f":"IF('Data entry form'!BU10<>\"\",'Data entry form'!BU10,\"\")","v":""}]
[null,null,"?",null,"Search end period (dd/mm/yyyy):   From",null,null,"to",null,null,{"$f":"IF(AND(G11=\"\",I11=\"\"),\"Consider entering search dates?\",IF(G11=\"\",\"Consider entering a start date?\",IF(I11=\"\",\"Consider entering an end date?\",\"Okay\")))","v":"Consider entering search dates?"},{"$nulls":48},"Unique code summary",{"$nulls":8},"Stage 8",{"$nulls":16},{"$f":"IF('Data entry form'!CG11<>\"\",'Data entry form'!CG11,\"\")","v":""},{"$f":"IF('Data entry form'!CH11<>0,'Data entry form'!CH11,\"\")","v":""},null,null,null,{"$f":"IF('Data entry form'!BU11<>\"\",'Data entry form'!BU11,\"\")","v":""}]
[{"$nulls":59},"Import data",{"$nulls":8},"Stage 9",{"$nulls":16},{"$f":"IF('Data entry form'!CG12<>\"\",'Data entry form'!CG12,\"\")","v":""},{"$f":"IF('Data entry form'!CH12<>0,'Data entry form'!CH12,\"\")","v":""},null,null,null,{"$f":"IF('Data entry form'!BU12<>\"\",'Data entry form'!BU12,\"\")","v":""}]
[null,null,"?",{"$nulls":56},"Imported selection",{"$nulls":8},"Final stage for sale",{"$nulls":16},{"$f":"IF('Data entry form'!CG13<>\"\",'Data entry form'!CG13,\"\")","v":""},{"$f":"IF('Data entry form'!CH13<>0,'Data entry form'!CH13,\"\")","v":""},null,null,null,{"$f":"IF('Data entry form'!BU13<>\"\",'Data entry form'!BU13,\"\")","v":""}]
[{"$nulls":59},"Space output",{"$nulls":25},{"$f":"IF('Data entry form'!CG14<>\"\",'Data entry form'!CG14,\"\")","v":""},{"$f":"IF('Data entry form'!CH14<>0,'Data entry form'!CH14,\"\")","v":""},null,null,null,{"$f":"IF('Data entry form'!BU14<>\"\",'Data entry form'!BU14,\"\")","v":""}]
[null,null,"?",null,"Enter container type",{"$nulls":5},{"$f":"IF(CV5=\"No selection\",\"Consider entering a container type?\",\"Okay\")","v":"Consider entering a container type?"},{"$nulls":48},"Nursery summary report",{"$nulls":25},{"$f":"IF('Data entry form'!CG15<>\"\",'Data entry form'!CG15,\"\")","v":""},{"$f":"IF('Data entry form'!CH15<>0,'Data entry form'!CH15,\"\")","v":""},null,null,null,{"$f":"IF('Data entry form'!BU15<>\"\",'Data entry form'!BU15,\"\")","v":""}]
[{"$nulls":59},"Stage 1",{"$nulls":25},{"$f":"IF('Data entry form'!CG16<>\"\",'Data entry form'!CG16,\"\")","v":""},{"$f":"IF('Data entry form'!CH16<>0,'Data entry form'!CH16,\"\")","v":""},null,null,null,{"$f":"IF('Data entry form'!BU16<>\"\",'Data entry form'!BU16,\"\")","v":""}]
[null,null,"?",null,"Enter at least the first three letters",{"$nulls":5},{"$f":"IF(G17=\"\",\"Search will include all variety names\",\"Okay\")","v":"Search will include all variety names"},{"$nulls":48},"Final stage for sale",{"$nulls":25},{"$f":"IF('Data entry form'!CG17<>\"\",'Data entry form'!CG17,\"\")","v":""},{"$f":"IF('Data entry form'!CH17<>0,'Data entry form'!CH17,\"\")","v":""},null,null,null,{"$f":"IF('Data entry form'!BU17<>\"\",'Data entry form'!BU17,\"\")","v":""}]
[{"$nulls":59},"Stage 2",{"$nulls":25},{"$f":"IF('Data entry form'!CG18<>\"\",'Data entry form'!CG18,\"\")","v":""},{"$f":"IF('Data entry form'!CH18<>0,'Data entry form'!CH18,\"\")","v":""},null,null,null,{"$f":"IF('Data entry form'!BU18<>\"\",'Data entry form'!BU18,\"\")","v":""}]
[null,null,"?",null,"Location site or environment type",{"$nulls":5},{"$f":"IF(CV6=\"No selection\",\"Search will include all sites\",\"Okay\")","v":"Search will include all sites"},{"$nulls":48},"Stage 3",{"$nulls":25},{"$f":"IF('Data entry form'!CG19<>\"\",'Data entry form'!CG19,\"\")","v":""},{"$f":"IF('Data entry form'!CH19<>0,'Data entry form'!CH19,\"\")","v":""},null,null,null,{"$f":"IF('Data entry form'!BU19<>\"\",'Data entry form'!BU19,\"\")","v":""}]
[{"$nulls":59},"Stage 4",{"$nulls":25},{"$f":"IF('Data entry form'!CG20<>\"\",'Data entry form'!CG20,\"\")","v":""},{"$f":"IF('Data entry form'!CH20<>0,'Data entry form'!CH20,\"\")","v":""},null,null,null,{"$f":"IF('Data entry form'!BU20<>\"\",'Data entry form'!BU20,\"\")","v":""}]
[null,null,"?",null,"Location area name or code",{"$nulls":5},{"$f":"IF(CV7=\"No selection\",\"Search will include all areas\",\"Okay\")","v":"Search will include all areas"},{"$nulls":48},"Stage 5",{"$nulls":25},{"$f":"IF('Data entry form'!CG21<>\"\",'Data entry form'!CG21,\"\")","v":""},{"$f":"IF('Data entry form'!CH21<>0,'Data entry form'!CH21,\"\")","v":""},null,null,null,{"$f":"IF('Data entry form'!BU21<>\"\",'Data entry form'!BU21,\"\")","v":""}]
[{"$nulls":59},"Stage 6",{"$nulls":25},{"$f":"IF('Data entry form'!CG22<>\"\",'Data entry form'!CG22,\"\")","v":""},{"$f":"IF('Data entry form'!CH22<>0,'Data entry form'!CH22,\"\")","v":""},null,null,null,{"$f":"IF('Data entry form'!BU22<>\"\",'Data entry form'!BU22,\"\")","v":""}]
[{"$nulls":59},"Stage 7",{"$nulls":25},{"$f":"IF('Data entry form'!CG23<>\"\",'Data entry form'!CG23,\"\")","v":""},{"$f":"IF('Data entry form'!CH23<>0,'Data entry form'!CH23,\"\")","v":""},null,null,null,{"$f":"IF('Data entry form'!BU23<>\"\",'Data entry form'!BU23,\"\")","v":""}]
[{"$nulls":59},"Stage 8",{"$nulls":25},{"$f":"IF('Data entry form'!CG24<>\"\",'Data entry form'!CG24,\"\")","v":""},{"$f":"IF('Data entry form'!CH24<>0,'Data entry form'!CH24,\"\")","v":""},null,null,null,{"$f":"IF('Data entry form'!BU24<>\"\",'Data entry form'!BU24,\"\")","v":""}]
[{"$nulls":59},"Stage 9",{"$nulls":25},{"$f":"IF('Data entry form'!CG25<>\"\",'Data entry form'!CG25,\"\")","v":""},{"$f":"IF('Data entry form'!CH25<>0,'Data entry form'!CH25,\"\")","v":""},null,null,null,{"$f":"IF('Data entry form'!BU25<>\"\",'Data entry form'!BU25,\"\")","v":""}]
[{"$nulls":59},"Menu",{"$nulls":25},{"$f":"IF('Data entry form'!CG26<>\"\",'Data entry form'!CG26,\"\")","v":""},{"$f":"IF('Data entry form'!CH26<>0,'Data entry form'!CH26,\"\")","v":""},null,null,null,{"$f":"IF('Data entry form'!BU26<>\"\",'Data entry form'!BU26,\"\")","v":""}]
[{"$nulls":59},"User guide",{"$nulls":25},{"$f":"IF('Data entry form'!CG27<>\"\",'Data entry form'!CG27,\"\")","v":""},{"$f":"IF('Data entry form'!CH27<>0,'Data entry form'!CH27,\"\")","v":""},null,null,null,{"$f":"IF('Data entry form'!BU27<>\"\",'Data entry form'!BU27,\"\")","v":""}]
[{"$nulls":59},"Contact us",{"$nulls":25},{"$f":"IF('Data entry form'!CG28<>\"\",'Data entry form'!CG28,\"\")","v":""},{"$f":"IF('Data entry form'!CH28<>0,'Data entry form'!CH28,\"\")","v":""},null,null,null,{"$f":"IF('Data entry form'!BU28<>\"\",'Data entry form'!BU28,\"\")","v":""}]
[{"$nulls":59},"Nursery details",{"$nulls":25},{"$f":"IF('Data entry form'!CG29<>\"\",'Data entry form'!CG29,\"\")","v":""},{"$f":"IF('Data entry form'!CH29<>0,'Data entry form'!CH29,\"\")","v":""},null,null,null,{"$f":"IF('Data entry form'!BU29<>\"\",'Data entry form'!BU29,\"\")","v":""}]
[{"$nulls":85},{"$f":"IF('Data entry form'!CG30<>\"\",'Data entry form'!CG30,\"\")","v":""},{"$f":"IF('Data entry form'!CH30<>0,'Data entry form'!CH30,\"\")","v":""},null,null,null,{"$f":"IF('Data entry form'!BU30<>\"\",'Data entry form'!BU30,\"\")","v":""}]
[{"$nulls":85},{"$f":"IF('Data entry form'!CG31<>\"\",'Data entry form'!CG31,\"\")","v":""},{"$f":"IF('Data entry form'!CH31<>0,'Data entry form'!CH31,\"\")","v":""},null,null,null,{"$f":"IF('Data entry form'!BU31<>\"\",'Data entry form'!BU31,\"\")","v":""}]
[{"$nulls":85},{"$f":"IF('Data entry form'!CG32<>\"\",'Data entry form'!CG32,\"\")","v":""},{"$f":"IF('Data entry form'!CH32<>0,'Data entry form'!CH32,\"\")","v":""},null,null,null,{"$f":"IF('Data entry form'!BU32<>\"\",'Data entry form'!BU32,\"\")","v":""}]
[{"$nulls":85},{"$f":"IF('Data entry form'!CG33<>\"\",'Data entry form'!CG33,\"\")","v":""},{"$f":"IF('Data entry form'!CH33<>0,'Data entry form'!CH33,\"\")","v":""},null,null,null,{"$f":"IF('Data entry form'!BU33<>\"\",'Data entry form'!BU33,\"\")","v":""}]
[{"$nulls":85},{"$f":"IF('Data entry form'!CG34<>\"\",'Data entry form'!CG34,\"\")","v":""},{"$f":"IF('Data entry form'!CH34<>0,'Data entry form'!CH34,\"\")","v":""},null,null,null,{"$f":"IF('Data entry form'!BU34<>\"\",'Data entry form'!BU34,\"\")","v":""}]
[{"$nulls":85},{"$f":"IF('Data entry form'!CG35<>\"\",'Data entry form'!CG35,\"\")","v":""},{"$f":"IF('Data entry form'!CH35<>0,'Data entry form'!CH35,\"\")","v":""},null,null,null,{"$f":"IF('Data entry form'!BU35<>\"\",'Data entry form'!BU35,\"\")","v":""}]
[{"$nulls":85},{"$f":"IF('Data entry form'!CG36<>\"\",'Data entry form'!CG36,\"\")","v":""},{"$f":"IF('Data entry form'!CH36<>0,'Data entry form'!CH36,\"\")","v":""},null,null,null,{"$f":"IF('Data entry form'!BU36<>\"\",'Data entry form'!BU36,\"\")","v":""}]
[{"$nulls":85},{"$f":"IF('Data entry form'!CG39<>\"\",'Data entry form'!CG39,\"\")","v":""},{"$f":"IF('Data entry form'!CH39<>0,'Data entry form'!CH39,\"\")","v":""},null,null,null,{"$f":"IF('Data entry form'!BU39<>\"\",'Data entry form'!BU39,\"\")","v":""}]
[{"$nulls":85},{"$f":"IF('Data entry form'!CG40<>\"\",'Data entry form'!CG40,\"\")","v":""},{"$f":"IF('Data entry form'!CH40<>0,'Data entry form'!CH40,\"\")","v":""},null,null,null,{"$f":"IF('Data entry form'!BU40<>\"\",'Data entry form'!BU40,\"\")","v":""}]
[{"$nulls":85},{"$f":"IF('Data entry form'!CG41<>\"\",'Data entry form'!CG41,\"\")","v":""},{"$f":"IF('Data entry form'!CH41<>0,'Data entry form'!CH41,\"\")","v":""},null,null,null,{"$f":"IF('Data entry form'!BU41<>\"\",'Data entry form'!BU41,\"\")","v":""}]
[{"$nulls":85},{"$f":"IF('Data entry form'!CG42<>\"\",'Data entry form'!CG42,\"\")","v":""},{"$f":"IF('Data entry form'!CH42<>0,'Data entry form'!CH42,\"\")","v":""},null,null,null,{"$f":"IF('Data entry form'!BU42<>\"\",'Data entry form'!BU42,\"\")","v":""}]
[{"$nulls":85},{"$f":"IF('Data entry form'!CG43<>\"\",'Data entry form'!CG43,\"\")","v":""},{"$f":"IF('Data entry form'!CH43<>0,'Data entry form'!CH43,\"\")","v":""},null,null,null,{"$f":"IF('Data entry form'!BU43<>\"\",'Data entry form'!BU43,\"\")","v":""}]
[{"$nulls":85},{"$f":"IF('Data entry form'!CG44<>\"\",'Data entry form'!CG44,\"\")","v":""},{"$f":"IF('Data entry form'!CH44<>0,'Data entry form'!CH44,\"\")","v":""},null,null,null,{"$f":"IF('Data entry form'!BU44<>\"\",'Data entry form'!BU44,\"\")","v":""}]
[{"$nulls":85},{"$f":"IF('Data entry form'!CG45<>\"\",'Data entry form'!CG45,\"\")","v":""},{"$f":"IF('Data entry form'!CH45<>0,'Data entry form'!CH45,\"\")","v":""},null,null,null,{"$f":"IF('Data entry form'!BU45<>\"\",'Data entry form'!BU45,\"\")","v":""}]
[{"$nulls":85},{"$f":"IF('Data entry form'!CG46<>\"\",'Data entry form'!CG46,\"\")","v":""},{"$f":"IF('Data entry form'!CH46<>0,'Data entry form'!CH46,\"\")","v":""},null,null,null,{"$f":"IF('Data entry form'!BU46<>\"\",'Data entry form'!BU46,\"\")","v":""}]
[{"$nulls":85},{"$f":"IF('Data entry form'!CG47<>\"\",'Data entry form'!CG47,\"\")","v":""},{"$f":"IF('Data entry form'!CH47<>0,'Data entry form'!CH47,\"\")","v":""},null,null,null,{"$f":"IF('Data entry form'!BU47<>\"\",'Data entry form'!BU47,\"\")","v":""}]
[{"$nulls":85},{"$f":"IF('Data entry form'!CG48<>\"\",'Data entry form'!CG48,\"\")","v":""},{"$f":"IF('Data entry form'!CH48<>0,'Data entry form'!CH48,\"\")","v":""},null,null,null,{"$f":"IF('Data entry form'!BU48<>\"\",'Data entry form'!BU48,\"\")","v":""}]
[{"$nulls":85},{"$f":"IF('Data entry form'!CG49<>\"\",'Data entry form'!CG49,\"\")","v":""},{"$f":"IF('Data entry form'!CH49<>0,'Data entry form'!CH49,\"\")","v":""},null,null,null,{"$f":"IF('Data entry form'!BU49<>\"\",'Data entry form'!BU49,\"\")","v":""}]
[{"$nulls":85},{"$f":"IF('Data entry form'!CG50<>\"\",'Data entry form'!CG50,\"\")","v":""},{"$f":"IF('Data entry form'!CH50<>0,'Data entry form'!CH50,\"\")","v":""},null,null,null,{"$f":"IF('Data entry form'!BU50<>\"\",'Data entry form'!BU50,\"\")","v":""}]
[{"$nulls":85},{"$f":"IF('Data entry form'!CG51<>\"\",'Data entry form'!CG51,\"\")","v":""},{"$f":"IF('Data entry form'!CH51<>0,'Data entry form'!CH51,\"\")","v":""},null,null,null,{"$f":"IF('Data entry form'!BU51<>\"\",'Data entry form'!BU51,\"\")","v":""}]
[{"$nulls":85},{"$f":"IF('Data entry form'!CG52<>\"\",'Data entry form'!CG52,\"\")","v":""},{"$f":"IF('Data entry form'!CH52<>0,'Data entry form'!CH52,\"\")","v":""},null,null,null,{"$f":"IF('Data entry form'!BU52<>\"\",'Data entry form'!BU52,\"\")","v":""}]
[{"$nulls":85},{"$f":"IF('Data entry form'!CG53<>\"\",'Data entry form'!CG53,\"\")","v":""},{"$f":"IF('Data entry form'!CH53<>0,'Data entry form'!CH53,\"\")","v":""},null,null,null,{"$f":"IF('Data entry form'!BU53<>\"\",'Data entry form'!BU53,\"\")","v":""}]
[{"$nulls":85},{"$f":"IF('Data entry form'!CG54<>\"\",'Data entry form'!CG54,\"\")","v":""},{"$f":"IF('Data entry form'!CH54<>0,'Data entry form'!CH54,\"\")","v":""},null,null,null,{"$f":"IF('Data entry form'!BU54<>\"\",'Data entry form'!BU54,\"\")","v":""}]
[{"$nulls":85},{"$f":"IF('Data entry form'!CG55<>\"\",'Data entry form'!CG55,\"\")","v":""},{"$f":"IF('Data entry form'!CH55<>0,'Data entry form'!CH55,\"\")","v":""},null,null,null,{"$f":"IF('Data entry form'!BU55<>\"\",'Data entry form'!BU55,\"\")","v":""}]
[{"$nulls":85},{"$f":"IF('Data entry form'!CG56<>\"\",'Data entry form'!CG56,\"\")","v":""},{"$f":"IF('Data entry form'!CH56<>0,'Data entry form'!CH56,\"\")","v":""},null,null,null,{"$f":"IF('Data entry form'!BU56<>\"\",'Data entry form'!BU56,\"\")","v":""}]
[{"$nulls":85},{"$f":"IF('Data entry form'!CG57<>\"\",'Data entry form'!CG57,\"\")","v":""},{"$f":"IF('Data entry form'!CH57<>0,'Data entry form'!CH57,\"\")","v":""},null,null,null,{"$f":"IF('Data entry form'!BU57<>\"\",'Data entry form'!BU57,\"\")","v":""}]
[{"$nulls":85},{"$f":"IF('Data entry form'!CG58<>\"\",'Data entry form'!CG58,\"\")","v":""},{"$f":"IF('Data entry form'!CH58<>0,'Data entry form'!CH58,\"\")","v":""},null,null,null,{"$f":"IF('Data entry form'!BU58<>\"\",'Data entry form'!BU58,\"\")","v":""}]
[{"$nulls":85},{"$f":"IF('Data entry form'!CG59<>\"\",'Data entry form'!CG59,\"\")","v":""},{"$f":"IF('Data entry form'!CH59<>0,'Data entry form'!CH59,\"\")","v":""},null,null,null,{"$f":"IF('Data entry form'!BU59<>\"\",'Data entry form'!BU59,\"\")","v":""}]

{"sheet":"Selection","index":8,"n_rows":517,"n_cols":102,"rows_kept":517,"cut":false,"hidden":false,"merged":[[22,8,22,9],[23,8,23,9],[24,8,24,9],[25,8,25,9],[26,8,26,9],[27,8,27,9],[16,8,16,9],[17,8,17,9],[18,8,18,9],[19,8,19,9],[20,8,20,9],[21,8,21,9],[34,8,34,9],[35,8,35,9],[36,8,36,9],[37,8,37,9],[38,8,38,9],[39,8,39,9],[28,8,28,9],[29,8,29,9],[30,8,30,9],[31,8,31,9],[32,8,32,9],[33,8,33,9],[46,8,46,9],[47,8,47,9],[48,8,48,9],[49,8,49,9],[50,8,50,9],[51,8,51,9],[40,8,40,9],[41,8,41,9],[42,8,42,9],[43,8,43,9],[44,8,44,9],[45,8,45,9],[58,8,58,9],[59,8,59,9],[60,8,60,9],[61,8,61,9],[62,8,62,9],[63,8,63,9],[52,8,52,9],[53,8,53,9],[54,8,54,9],[55,8,55,9],[56,8,56,9],[57,8,57,9],[70,8,70,9],[71,8,71,9],[72,8,72,9],[73,8,73,9],[74,8,74,9],[75,8,75,9],[64,8,64,9],[65,8,65,9],[66,8,66,9],[67,8,67,9],[68,8,68,9],[69,8,69,9],[82,8,82,9],[83,8,83,9],[84,8,84,9],[85,8,85,9],[86,8,86,9],[87,8,87,9],[76,8,76,9],[77,8,77,9],[78,8,78,9],[79,8,79,9],[80,8,80,9],[81,8,81,9],[94,8,94,9],[95,8,95,9],[96,8,96,9],[97,8,97,9],[98,8,98,9],[99,8,99,9],[88,8,88,9],[89,8,89,9],[90,8,90,9],[91,8,91,9],[92,8,92,9],[93,8,93,9],[106,8,106,9],[107,8,107,9],[108,8,108,9],[109,8,109,9],[110,8,110,9],[111,8,111,9],[100,8,100,9],[101,8,101,9],[102,8,102,9],[103,8,103,9],[104,8,104,9],[105,8,105,9],[118,8,118,9],[119,8,119,9],[120,8,120,9],[121,8,121,9],[122,8,122,9],[123,8,123,9],[112,8,112,9],[113,8,113,9],[114,8,114,9],[115,8,115,9],[116,8,116,9],[117,8,117,9],[130,8,130,9],[131,8,131,9],[132,8,132,9],[133,8,133,9],[134,8,134,9],[135,8,135,9],[124,8,124,9],[125,8,125,9],[126,8,126,9],[127,8,127,9],[128,8,128,9],[129,8,129,9],[142,8,142,9],[143,8,143,9],[144,8,144,9],[145,8,145,9],[146,8,146,9],[147,8,147,9],[136,8,136,9],[137,8,137,9],[138,8,138,9],[139,8,139,9],[140,8,140,9],[141,8,141,9],[154,8,154,9],[155,8,155,9],[156,8,156,9],[157,8,157,9],[158,8,158,9],[159,8,159,9],[148,8,148,9],[149,8,149,9],[150,8,150,9],[151,8,151,9],[152,8,152,9],[153,8,153,9],[166,8,166,9],[167,8,167,9],[168,8,168,9],[169,8,169,9],[170,8,170,9],[171,8,171,9],[160,8,160,9],[161,8,161,9],[162,8,162,9],[163,8,163,9],[164,8,164,9],[165,8,165,9],[178,8,178,9],[179,8,179,9],[180,8,180,9],[181,8,181,9],[182,8,182,9],[183,8,183,9],[172,8,172,9],[173,8,173,9],[174,8,174,9],[175,8,175,9],[176,8,176,9],[177,8,177,9],[190,8,190,9],[191,8,191,9],[192,8,192,9],[193,8,193,9],[194,8,194,9],[195,8,195,9],[184,8,184,9],[185,8,185,9],[186,8,186,9],[187,8,187,9],[188,8,188,9],[189,8,189,9],[202,8,202,9],[203,8,203,9],[204,8,204,9],[205,8,205,9],[206,8,206,9],[207,8,207,9],[196,8,196,9],[197,8,197,9],[198,8,198,9],[199,8,199,9],[200,8,200,9],[201,8,201,9],[214,8,214,9],[215,8,215,9],[216,8,216,9],[217,8,217,9],[218,8,218,9],[219,8,219,9],[208,8,208,9],[209,8,209,9],[210,8,210,9],[211,8,211,9],[212,8,212,9],[213,8,213,9],[226,8,226,9],[227,8,227,9],[228,8,228,9],[229,8,229,9],[230,8,230,9],[231,8,231,9],[220,8,220,9],[221,8,221,9],[222,8,222,9],[223,8,223,9],[224,8,224,9],[225,8,225,9],[238,8,238,9],[239,8,239,9],[240,8,240,9],[241,8,241,9],[242,8,242,9],[243,8,243,9],[232,8,232,9],[233,8,233,9],[234,8,234,9],[235,8,235,9],[236,8,236,9],[237,8,237,9],[250,8,250,9],[251,8,251,9],[252,8,252,9],[253,8,253,9],[254,8,254,9],[255,8,255,9],[244,8,244,9],[245,8,245,9],[246,8,246,9],[247,8,247,9],[248,8,248,9],[249,8,249,9],[262,8,262,9],[263,8,263,9],[264,8,264,9],[265,8,265,9],[266,8,266,9],[267,8,267,9],[256,8,256,9],[257,8,257,9],[258,8,258,9],[259,8,259,9],[260,8,260,9],[261,8,261,9],[274,8,274,9],[275,8,275,9],[276,8,276,9],[277,8,277,9],[278,8,278,9],[279,8,279,9],[268,8,268,9],[269,8,269,9],[270,8,270,9],[271,8,271,9],[272,8,272,9],[273,8,273,9],[286,8,286,9],[287,8,287,9],[288,8,288,9],[289,8,289,9],[290,8,290,9],[291,8,291,9],[280,8,280,9],[281,8,281,9],[282,8,282,9],[283,8,283,9],[284,8,284,9],[285,8,285,9],[298,8,298,9],[299,8,299,9],[300,8,300,9],[301,8,301,9],[302,8,302,9],[303,8,303,9],[292,8,292,9],[293,8,293,9],[294,8,294,9],[295,8,295,9],[296,8,296,9],[297,8,297,9],[310,8,310,9],[311,8,311,9],[312,8,312,9],[313,8,313,9],[314,8,314,9],[315,8,315,9],[304,8,304,9],[305,8,305,9],[306,8,306,9],[307,8,307,9],[308,8,308,9],[309,8,309,9],[322,8,322,9],[323,8,323,9],[324,8,324,9],[325,8,325,9],[326,8,326,9],[327,8,327,9],[316,8,316,9],[317,8,317,9],[318,8,318,9],[319,8,319,9],[320,8,320,9],[321,8,321,9],[334,8,334,9],[335,8,335,9],[336,8,336,9],[337,8,337,9],[338,8,338,9],[339,8,339,9],[328,8,328,9],[329,8,329,9],[330,8,330,9],[331,8,331,9],[332,8,332,9],[333,8,333,9],[346,8,346,9],[347,8,347,9],[348,8,348,9],[349,8,349,9],[350,8,350,9],[351,8,351,9],[340,8,340,9],[341,8,341,9],[342,8,342,9],[343,8,343,9],[344,8,344,9],[345,8,345,9],[358,8,358,9],[359,8,359,9],[360,8,360,9],[361,8,361,9],[362,8,362,9],[363,8,363,9],[352,8,352,9],[353,8,353,9],[354,8,354,9],[355,8,355,9],[356,8,356,9],[357,8,357,9],[370,8,370,9],[371,8,371,9],[372,8,372,9],[373,8,373,9],[374,8,374,9],[375,8,375,9],[364,8,364,9],[365,8,365,9],[366,8,366,9],[367,8,367,9],[368,8,368,9],[369,8,369,9],[382,8,382,9],[383,8,383,9],[384,8,384,9],[385,8,385,9],[386,8,386,9],[387,8,387,9],[376,8,376,9],[377,8,377,9],[378,8,378,9],[379,8,379,9],[380,8,380,9],[381,8,381,9],[394,8,394,9],[395,8,395,9],[396,8,396,9],[397,8,397,9],[398,8,398,9],[399,8,399,9],[388,8,388,9],[389,8,389,9],[390,8,390,9],[391,8,391,9],[392,8,392,9],[393,8,393,9],[406,8,406,9],[407,8,407,9],[408,8,408,9],[409,8,409,9],[410,8,410,9],[411,8,411,9],[400,8,400,9],[401,8,401,9],[402,8,402,9],[403,8,403,9],[404,8,404,9],[405,8,405,9],[418,8,418,9],[419,8,419,9],[420,8,420,9],[421,8,421,9],[422,8,422,9],[423,8,423,9],[412,8,412,9],[413,8,413,9],[414,8,414,9],[415,8,415,9],[416,8,416,9],[417,8,417,9],[430,8,430,9],[431,8,431,9],[432,8,432,9],[433,8,433,9],[434,8,434,9],[435,8,435,9],[424,8,424,9],[425,8,425,9],[426,8,426,9],[427,8,427,9],[428,8,428,9],[429,8,429,9],[442,8,442,9],[443,8,443,9],[444,8,444,9],[445,8,445,9],[446,8,446,9],[447,8,447,9],[436,8,436,9],[437,8,437,9],[438,8,438,9],[439,8,439,9],[440,8,440,9],[441,8,441,9],[454,8,454,9],[455,8,455,9],[456,8,456,9],[457,8,457,9],[458,8,458,9],[459,8,459,9],[448,8,448,9],[449,8,449,9],[450,8,450,9],[451,8,451,9],[452,8,452,9],[453,8,453,9],[466,8,466,9],[467,8,467,9],[468,8,468,9],[469,8,469,9],[470,8,470,9],[471,8,471,9],[460,8,460,9],[461,8,461,9],[462,8,462,9],[463,8,463,9],[464,8,464,9],[465,8,465,9],[478,8,478,9],[479,8,479,9],[480,8,480,9],[481,8,481,9],[482,8,482,9],[483,8,483,9],[472,8,472,9],[473,8,473,9],[474,8,474,9],[475,8,475,9],[476,8,476,9],[477,8,477,9],[490,8,490,9],[491,8,491,9],[492,8,492,9],[493,8,493,9],[494,8,494,9],[495,8,495,9],[484,8,484,9],[485,8,485,9],[486,8,486,9],[487,8,487,9],[488,8,488,9],[489,8,489,9],[502,8,502,9],[503,8,503,9],[504,8,504,9],[505,8,505,9],[506,8,506,9],[507,8,507,9],[496,8,496,9],[497,8,497,9],[498,8,498,9],[499,8,499,9],[500,8,500,9],[501,8,501,9],[514,8,514,9],[515,8,515,9],[516,8,516,9],[517,8,517,9],[518,8,518,9],[519,8,519,9],[508,8,508,9],[509,8,509,9],[510,8,510,9],[511,8,511,9],[512,8,512,9],[513,8,513,9],[526,8,526,9],[527,8,527,9],[528,8,528,9],[529,8,529,9],[530,8,530,9],[531,8,531,9],[520,8,520,9],[521,8,521,9],[522,8,522,9],[523,8,523,9],[524,8,524,9],[525,8,525,9],[538,8,538,9],[539,8,539,9],[540,8,540,9],[541,8,541,9],[542,8,542,9],[543,8,543,9],[532,8,532,9],[533,8,533,9],[534,8,534,9],[535,8,535,9],[536,8,536,9],[537,8,537,9],[550,8,550,9],[551,8,551,9],[552,8,552,9],[553,8,553,9],[554,8,554,9],[555,8,555,9],[544,8,544,9],[545,8,545,9],[546,8,546,9],[547,8,547,9],[548,8,548,9],[549,8,549,9],[562,8,562,9],[563,8,563,9],[564,8,564,9],[565,8,565,9],[566,8,566,9],[567,8,567,9],[556,8,556,9],[557,8,557,9],[558,8,558,9],[559,8,559,9],[560,8,560,9],[561,8,561,9],[574,8,574,9],[575,8,575,9],[576,8,576,9],[577,8,577,9],[578,8,578,9],[579,8,579,9],[568,8,568,9],[569,8,569,9],[570,8,570,9],[571,8,571,9],[572,8,572,9],[573,8,573,9],[586,8,586,9],[587,8,587,9],[588,8,588,9],[589,8,589,9],[590,8,590,9],[591,8,591,9],[580,8,580,9],[581,8,581,9],[582,8,582,9],[583,8,583,9],[584,8,584,9],[585,8,585,9],[598,8,598,9],[599,8,599,9],[600,8,600,9],[601,8,601,9],[602,8,602,9],[603,8,603,9],[592,8,592,9],[593,8,593,9],[594,8,594,9],[595,8,595,9],[596,8,596,9],[597,8,597,9],[616,8,616,9],[610,8,610,9],[611,8,611,9],[612,8,612,9],[613,8,613,9],[614,8,614,9],[615,8,615,9],[604,8,604,9],[605,8,605,9],[606,8,606,9],[607,8,607,9],[608,8,608,9],[609,8,609,9]]}
[{"$nulls":59},"DROP DOWN MENU PAGES",null,null,null,"PRODUCTION STAGES",{"$nulls":4},"Range names",{"$nulls":23},"?","STAGES",{"$nulls":7},"DROP DOWN MENU PAGES"]
[{"$nulls":6},"Selection           "]
[{"$nulls":7},"Go to"]
[{"$nulls":59},"Production stage",null,null,null,"Production stage","Number",null,null,null,"Production stage",{"$nulls":24},"Stages","Stage Number",{"$nulls":6},"Production stage"]
[{"$nulls":63},"None",0,null,null,null,"Stage 1",{"$nulls":24},"No selection","Stage 0"]
[null,null,"?",null,"Codes meeting the search criteria",null,null,"To load information for a single unique code to the Data entry form",{"$nulls":51},"Data entry form",null,null,null,"Final stage for sale",10,null,null,null,"Stage 2",{"$nulls":24},"1st stage","Stage 1",{"$nulls":6},"Financial data"]
[{"$nulls":4},"Search start period:","  to  ",{"$nulls":53},"Search",null,null,null,"Stage 1",1,null,null,null,"Stage 3",{"$nulls":24},"2nd stage","Stage 2",{"$nulls":6},"Surplus or loss summary"]
[{"$nulls":4},"Nursery weeks:","  to  ",{"$nulls":53},"Selection",null,null,null,"Stage 2",2,null,null,null,"Stage 4",{"$nulls":24},"3rd stage","Stage 3",{"$nulls":6},"Surplus or loss output"]
[{"$nulls":4},"Search end period:","  to  ",{"$nulls":53},"Actions",null,null,null,"Stage 3",3,null,null,null,"Stage 5",{"$nulls":24},"4th stage","Stage 4",{"$nulls":6},"Production cost output"]
[{"$nulls":4},"Nursery weeks:","  to  ",null,"Select required production stage",{"$nulls":51},"Actions summary",null,null,null,"Stage 4",4,null,null,null,"Stage 6",{"$nulls":24},"5th stage","Stage 5",{"$nulls":6},"Progress report"]
[{"$nulls":4},"Container: No selection","Partial name: None ",{"$nulls":53},"Unique code summary",null,null,null,"Stage 5",5,null,null,null,"Stage 7",{"$nulls":24},"6th stage","Stage 6",{"$nulls":6},"Stage 1"]
[{"$nulls":4},"Site / Location: ",null,null,"Load information to the Data entry form",{"$nulls":51},"Import data",null,null,null,"Stage 6",6,null,null,null,"Stage 8",{"$nulls":24},"7th stage","Stage 7",{"$nulls":6},"Final stage for sale"]
[{"$nulls":4},"Area: ",{"$nulls":54},"Imported selection",null,null,null,"Stage 7",7,null,null,null,"Stage 9",{"$nulls":24},"8th stage","Stage 8",{"$nulls":6},"Stage 2"]
[{"$nulls":59},"Space output",null,null,null,"Stage 8",8,null,null,null,"Final stage for sale",{"$nulls":24},"9th stage","Stage 9",{"$nulls":6},"Stage 3"]
[{"$nulls":4},"Species / variety name","Unique batch code",null,"Selected batches",{"$nulls":51},"Nursery summary report",null,null,null,"Stage 9",9,{"$nulls":28},"Final stage","Final stage for sale",{"$nulls":6},"Stage 4"]
[{"$nulls":59},"Stage 1",{"$nulls":28},"SORTING DATA",{"$nulls":12},"Stage 5"]
[{"$nulls":4},"","",{"$nulls":53},"Final stage for sale",{"$nulls":26},"2013-01-07",null,"Crop A515","CroA969-2/2013-1",{"$nulls":11},"Stage 6"]
[{"$nulls":4},"","",{"$nulls":53},"Stage 2",{"$nulls":26},"2013-01-07",null,"Crop A516","CroA970-2/2013-1",{"$nulls":11},"Stage 7"]
[{"$nulls":4},"","",{"$nulls":53},"Stage 3",{"$nulls":26},"2013-01-07",null,"Crop A517","CroA971-2/2013-1",{"$nulls":11},"Stage 8"]
[{"$nulls":4},"","",{"$nulls":53},"Stage 4",{"$nulls":26},"2013-01-07",null,"Crop A518","CroA972-2/2013-1",{"$nulls":11},"Stage 9"]
[{"$nulls":4},"","",{"$nulls":53},"Stage 5",{"$nulls":26},"2013-01-07",null,"Crop A519","CroA973-2/2013-1"]
[{"$nulls":4},"","",{"$nulls":53},"Stage 6",{"$nulls":26},"2013-01-07",null,"Crop A520","CroA974-2/2013-1"]
[{"$nulls":4},"","",{"$nulls":53},"Stage 7",{"$nulls":26},"2013-01-07",null,"Crop A521","CroA975-2/2013-1"]
[{"$nulls":4},"","",{"$nulls":53},"Stage 8",{"$nulls":26},"2013-01-07",null,"Crop A522","CroA976-2/2013-1"]
[{"$nulls":4},"","",{"$nulls":53},"Stage 9",{"$nulls":26},"2013-01-07",null,"Crop A523","CroA977-2/2013-1"]
[{"$nulls":4},"","",{"$nulls":53},"Menu",{"$nulls":26},"2013-01-07",null,"Crop A524","CroA978-2/2013-1"]
[{"$nulls":4},"","",{"$nulls":53},"User guide",{"$nulls":26},"2013-01-07",null,"Crop A525","CroA979-2/2013-1"]
[{"$nulls":4},"","",{"$nulls":53},"Contact us",{"$nulls":26},"2013-01-07",null,"Crop A526","CroA980-2/2013-1"]
[{"$nulls":59},"Nursery details"]
{"$rows_empty":17}
[{"$nulls":7},"",""]
[{"$nulls":7},"",""]
[{"$nulls":7},"",""]
[{"$nulls":7},"",""]
[{"$nulls":7},"",""]
[{"$nulls":7},"",""]
[{"$nulls":7},"",""]
[{"$nulls":7},"",""]
[{"$nulls":7},"",""]
[{"$nulls":7},"",""]
[{"$nulls":7},"",""]
[{"$nulls":7},"",""]
[{"$nulls":7},"",""]
[{"$nulls":7},"",""]
[{"$nulls":7},"",""]
[{"$nulls":7},"",""]
[{"$nulls":7},"",""]
[{"$nulls":7},"",""]
[{"$nulls":7},"",""]
[{"$nulls":7},"",""]
[{"$nulls":7},"",""]
[{"$nulls":7},"",""]
[{"$nulls":7},"",""]
[{"$nulls":7},"",""]
[{"$nulls":7},"",""]
[{"$nulls":7},"",""]
[{"$nulls":7},"",""]
[{"$nulls":7},"",""]
[{"$nulls":7},"",""]
[{"$nulls":7},"",""]
[{"$nulls":7},"",""]
[{"$nulls":7},"",""]
[{"$nulls":7},"",""]
[{"$nulls":7},"",""]
[{"$nulls":7},"",""]
[{"$nulls":7},"",""]
[{"$nulls":7},"",""]
[{"$nulls":7},"",""]
[{"$nulls":7},"",""]
[{"$nulls":7},"",""]
[{"$nulls":7},"",""]
[{"$nulls":7},"",""]
[{"$nulls":7},"",""]
[{"$nulls":7},"",""]
[{"$nulls":7},"",""]
[{"$nulls":7},"",""]
[{"$nulls":7},"",""]
[{"$nulls":7},"",""]
[{"$nulls":7},"",""]
[{"$nulls":7},"",""]
[{"$nulls":7},"",""]
[{"$nulls":7},"",""]
[{"$nulls":7},"",""]
[{"$nulls":7},"",""]
[{"$nulls":7},"",""]
[{"$nulls":7},"",""]
[{"$nulls":7},"",""]
[{"$nulls":7},"",""]
[{"$nulls":7},"",""]
[{"$nulls":7},"",""]
[{"$nulls":7},"",""]
[{"$nulls":7},"",""]
[{"$nulls":7},"",""]
[{"$nulls":7},"",""]
[{"$nulls":7},"",""]
[{"$nulls":7},"",""]
[{"$nulls":7},"",""]
[{"$nulls":7},"",""]
[{"$nulls":7},"",""]
[{"$nulls":7},"",""]
[{"$nulls":7},"",""]
[{"$nulls":7},"",""]
[{"$nulls":7},"",""]
[{"$nulls":7},"",""]
[{"$nulls":7},"",""]
[{"$nulls":7},"",""]
[{"$nulls":7},"",""]
[{"$nulls":7},"",""]
[{"$nulls":7},"",""]
[{"$nulls":7},"",""]
[{"$nulls":7},"",""]
[{"$nulls":7},"",""]
[{"$nulls":7},"",""]
[{"$nulls":7},"",""]
[{"$nulls":7},"",""]
[{"$nulls":7},"",""]
[{"$nulls":7},"",""]
[{"$nulls":7},"",""]
[{"$nulls":7},"",""]
[{"$nulls":7},"",""]
[{"$nulls":7},"",""]
[{"$nulls":7},"",""]
[{"$nulls":7},"",""]
[{"$nulls":7},"",""]
[{"$nulls":7},"",""]
[{"$nulls":7},"",""]
[{"$nulls":7},"",""]
[{"$nulls":7},"",""]
[{"$nulls":7},"",""]
[{"$nulls":7},"",""]
[{"$nulls":7},"",""]
[{"$nulls":7},"",""]
[{"$nulls":7},"",""]
[{"$nulls":7},"",""]
[{"$nulls":7},"",""]
[{"$nulls":7},"",""]
[{"$nulls":7},"",""]
[{"$nulls":7},"",""]
[{"$nulls":7},"",""]
[{"$nulls":7},"",""]
[{"$nulls":7},"",""]
[{"$nulls":7},"",""]
[{"$nulls":7},"",""]
[{"$nulls":7},"",""]
[{"$nulls":7},"",""]
[{"$nulls":7},"",""]
[{"$nulls":7},"",""]
[{"$nulls":7},"",""]
[{"$nulls":7},"",""]
[{"$nulls":7},"",""]
[{"$nulls":7},"",""]
[{"$nulls":7},"",""]
[{"$nulls":7},"",""]
[{"$nulls":7},"",""]
[{"$nulls":7},"",""]
[{"$nulls":7},"",""]
[{"$nulls":7},"",""]
[{"$nulls":7},"",""]
[{"$nulls":7},"",""]
[{"$nulls":7},"",""]
[{"$nulls":7},"",""]
[{"$nulls":7},"",""]
[{"$nulls":7},"",""]
[{"$nulls":7},"",""]
[{"$nulls":7},"",""]
[{"$nulls":7},"",""]
[{"$nulls":7},"",""]
[{"$nulls":7},"",""]
[{"$nulls":7},"",""]
[{"$nulls":7},"",""]
[{"$nulls":7},"",""]
[{"$nulls":7},"",""]
[{"$nulls":7},"",""]
[{"$nulls":7},"",""]
[{"$nulls":7},"",""]
[{"$nulls":7},"",""]
[{"$nulls":7},"",""]
[{"$nulls":7},"",""]
[{"$nulls":7},"",""]
[{"$nulls":7},"",""]
[{"$nulls":7},"",""]
[{"$nulls":7},"",""]
[{"$nulls":7},"",""]
[{"$nulls":7},"",""]
[{"$nulls":7},"",""]
[{"$nulls":7},"",""]
[{"$nulls":7},"",""]
[{"$nulls":7},"",""]
[{"$nulls":7},"",""]
[{"$nulls":7},"",""]
[{"$nulls":7},"",""]
[{"$nulls":7},"",""]
[{"$nulls":7},"",""]
[{"$nulls":7},"",""]
[{"$nulls":7},"",""]
[{"$nulls":7},"",""]
[{"$nulls":7},"",""]
[{"$nulls":7},"",""]
[{"$nulls":7},"",""]
[{"$nulls":7},"",""]
[{"$nulls":7},"",""]
[{"$nulls":7},"",""]
[{"$nulls":7},"",""]
[{"$nulls":7},"",""]
[{"$nulls":7},"",""]
[{"$nulls":7},"",""]
[{"$nulls":7},"",""]
[{"$nulls":7},"",""]
[{"$nulls":7},"",""]
[{"$nulls":7},"",""]
[{"$nulls":7},"",""]
[{"$nulls":7},"",""]
[{"$nulls":7},"",""]
[{"$nulls":7},"",""]
[{"$nulls":7},"",""]
[{"$nulls":7},"",""]
[{"$nulls":7},"",""]
[{"$nulls":7},"",""]
[{"$nulls":7},"",""]
[{"$nulls":7},"",""]
[{"$nulls":7},"",""]
[{"$nulls":7},"",""]
[{"$nulls":7},"",""]
[{"$nulls":7},"",""]
[{"$nulls":7},"",""]
[{"$nulls":7},"",""]
[{"$nulls":7},"",""]
[{"$nulls":7},"",""]
[{"$nulls":7},"",""]
[{"$nulls":7},"",""]
[{"$nulls":7},"",""]
[{"$nulls":7},"",""]
[{"$nulls":7},"",""]
[{"$nulls":7},"",""]
[{"$nulls":7},"",""]
[{"$nulls":7},"",""]
[{"$nulls":7},"",""]
[{"$nulls":7},"",""]
[{"$nulls":7},"",""]
[{"$nulls":7},"",""]
[{"$nulls":7},"",""]
[{"$nulls":7},"",""]
[{"$nulls":7},"",""]
[{"$nulls":7},"",""]
[{"$nulls":7},"",""]
[{"$nulls":7},"",""]
[{"$nulls":7},"",""]
[{"$nulls":7},"",""]
[{"$nulls":7},"",""]
[{"$nulls":7},"",""]
[{"$nulls":7},"",""]
[{"$nulls":7},"",""]
[{"$nulls":7},"",""]
[{"$nulls":7},"",""]
[{"$nulls":7},"",""]
[{"$nulls":7},"",""]
[{"$nulls":7},"",""]
[{"$nulls":7},"",""]
[{"$nulls":7},"",""]
[{"$nulls":7},"",""]
[{"$nulls":7},"",""]
[{"$nulls":7},"",""]
[{"$nulls":7},"",""]
[{"$nulls":7},"",""]
[{"$nulls":7},"",""]
[{"$nulls":7},"",""]
[{"$nulls":7},"",""]
[{"$nulls":7},"",""]
[{"$nulls":7},"",""]
[{"$nulls":7},"",""]
[{"$nulls":7},"",""]
[{"$nulls":7},"",""]
[{"$nulls":7},"",""]
[{"$nulls":7},"",""]
[{"$nulls":7},"",""]
[{"$nulls":7},"",""]
[{"$nulls":7},"",""]
[{"$nulls":7},"",""]
[{"$nulls":7},"",""]
[{"$nulls":7},"",""]
[{"$nulls":7},"",""]
[{"$nulls":7},"",""]
[{"$nulls":7},"",""]
[{"$nulls":7},"",""]
[{"$nulls":7},"",""]
[{"$nulls":7},"",""]
[{"$nulls":7},"",""]
[{"$nulls":7},"",""]
[{"$nulls":7},"",""]
[{"$nulls":7},"",""]
[{"$nulls":7},"",""]
[{"$nulls":7},"",""]
[{"$nulls":7},"",""]
[{"$nulls":7},"",""]
[{"$nulls":7},"",""]
[{"$nulls":7},"",""]
[{"$nulls":7},"",""]
[{"$nulls":7},"",""]
[{"$nulls":7},"",""]
[{"$nulls":7},"",""]
[{"$nulls":7},"",""]
[{"$nulls":7},"",""]
[{"$nulls":7},"",""]
[{"$nulls":7},"",""]
[{"$nulls":7},"",""]
[{"$nulls":7},"",""]
[{"$nulls":7},"",""]
[{"$nulls":7},"",""]
[{"$nulls":7},"",""]
[{"$nulls":7},"",""]
[{"$nulls":7},"",""]
[{"$nulls":7},"",""]
[{"$nulls":7},"",""]
[{"$nulls":7},"",""]
[{"$nulls":7},"",""]
[{"$nulls":7},"",""]
[{"$nulls":7},"",""]
[{"$nulls":7},"",""]
[{"$nulls":7},"",""]
[{"$nulls":7},"",""]
[{"$nulls":7},"",""]
[{"$nulls":7},"",""]
[{"$nulls":7},"",""]
[{"$nulls":7},"",""]
[{"$nulls":7},"",""]
[{"$nulls":7},"",""]
[{"$nulls":7},"",""]
[{"$nulls":7},"",""]
[{"$nulls":7},"",""]
[{"$nulls":7},"",""]
[{"$nulls":7},"",""]
[{"$nulls":7},"",""]
[{"$nulls":7},"",""]
[{"$nulls":7},"",""]
[{"$nulls":7},"",""]
[{"$nulls":7},"",""]
[{"$nulls":7},"",""]
[{"$nulls":7},"",""]
[{"$nulls":7},"",""]
[{"$nulls":7},"",""]
[{"$nulls":7},"",""]
[{"$nulls":7},"",""]
[{"$nulls":7},"",""]
[{"$nulls":7},"",""]
[{"$nulls":7},"",""]
[{"$nulls":7},"",""]
[{"$nulls":7},"",""]
[{"$nulls":7},"",""]
[{"$nulls":7},"",""]
[{"$nulls":7},"",""]
[{"$nulls":7},"",""]
[{"$nulls":7},"",""]
[{"$nulls":7},"",""]
[{"$nulls":7},"",""]
[{"$nulls":7},"",""]
[{"$nulls":7},"",""]
[{"$nulls":7},"",""]
[{"$nulls":7},"",""]
[{"$nulls":7},"",""]
[{"$nulls":7},"",""]
[{"$nulls":7},"",""]
[{"$nulls":7},"",""]
[{"$nulls":7},"",""]
[{"$nulls":7},"",""]
[{"$nulls":7},"",""]
[{"$nulls":7},"",""]
[{"$nulls":7},"",""]
[{"$nulls":7},"",""]
[{"$nulls":7},"",""]
[{"$nulls":7},"",""]
[{"$nulls":7},"",""]
[{"$nulls":7},"",""]
[{"$nulls":7},"",""]
[{"$nulls":7},"",""]
[{"$nulls":7},"",""]
[{"$nulls":7},"",""]
[{"$nulls":7},"",""]
[{"$nulls":7},"",""]
[{"$nulls":7},"",""]
[{"$nulls":7},"",""]
[{"$nulls":7},"",""]
[{"$nulls":7},"",""]
[{"$nulls":7},"",""]
[{"$nulls":7},"",""]
[{"$nulls":7},"",""]
[{"$nulls":7},"",""]
[{"$nulls":7},"",""]
[{"$nulls":7},"",""]
[{"$nulls":7},"",""]
[{"$nulls":7},"",""]
[{"$nulls":7},"",""]
[{"$nulls":7},"",""]
[{"$nulls":7},"",""]
[{"$nulls":7},"",""]
[{"$nulls":7},"",""]
[{"$nulls":7},"",""]
[{"$nulls":7},"",""]
[{"$nulls":7},"",""]
[{"$nulls":7},"",""]
[{"$nulls":7},"",""]
[{"$nulls":7},"",""]
[{"$nulls":7},"",""]
[{"$nulls":7},"",""]
[{"$nulls":7},"",""]
[{"$nulls":7},"",""]
[{"$nulls":7},"",""]
[{"$nulls":7},"",""]
[{"$nulls":7},"",""]
[{"$nulls":7},"",""]
[{"$nulls":7},"",""]
[{"$nulls":7},"",""]
[{"$nulls":7},"",""]
[{"$nulls":7},"",""]
[{"$nulls":7},"",""]
[{"$nulls":7},"",""]
[{"$nulls":7},"",""]
[{"$nulls":7},"",""]
[{"$nulls":7},"",""]
[{"$nulls":7},"",""]
[{"$nulls":7},"",""]
[{"$nulls":7},"",""]
[{"$nulls":7},"",""]
[{"$nulls":7},"",""]
[{"$nulls":7},"",""]
[{"$nulls":7},"",""]
[{"$nulls":7},"",""]
[{"$nulls":7},"",""]
[{"$nulls":7},"",""]
[{"$nulls":7},"",""]
[{"$nulls":7},"",""]
[{"$nulls":7},"",""]
[{"$nulls":7},"",""]
[{"$nulls":7},"",""]
[{"$nulls":7},"",""]
[{"$nulls":7},"",""]
[{"$nulls":7},"",""]
[{"$nulls":7},"",""]
[{"$nulls":7},"",""]
[{"$nulls":7},"",""]
[{"$nulls":7},"",""]
[{"$nulls":7},"",""]
[{"$nulls":7},"",""]
[{"$nulls":7},"",""]
[{"$nulls":7},"",""]
[{"$nulls":7},"",""]
[{"$nulls":7},"",""]
[{"$nulls":7},"",""]
[{"$nulls":7},"",""]
[{"$nulls":7},"",""]
[{"$nulls":7},"",""]
[{"$nulls":7},"",""]
[{"$nulls":7},"",""]
[{"$nulls":7},"",""]
[{"$nulls":7},"",""]
[{"$nulls":7},"",""]
[{"$nulls":7},"",""]
[{"$nulls":7},"",""]
[{"$nulls":7},"",""]
[{"$nulls":7},"",""]
[{"$nulls":7},"",""]
[{"$nulls":7},"",""]
[{"$nulls":7},"",""]
[{"$nulls":7},"",""]
[{"$nulls":7},"",""]
[{"$nulls":7},"",""]
[{"$nulls":7},"",""]
[{"$nulls":7},"",""]
[{"$nulls":7},"",""]
[{"$nulls":7},"",""]
[{"$nulls":7},"",""]
[{"$nulls":7},"",""]
[{"$nulls":7},"",""]
[{"$nulls":7},"",""]
[{"$nulls":7},"",""]
[{"$nulls":7},"",""]
[{"$nulls":7},"",""]
[{"$nulls":7},"",""]
[{"$nulls":7},"",""]
[{"$nulls":7},"",""]
[{"$nulls":7},"",""]
[{"$nulls":7},"",""]
[{"$nulls":7},"",""]
[{"$nulls":7},"",""]
[{"$nulls":7},"",""]
[{"$nulls":7},"",""]
[{"$nulls":7},"",""]
[{"$nulls":7},"",""]
[{"$nulls":7},"",""]
[{"$nulls":7},"",""]
[{"$nulls":7},"",""]
[{"$nulls":7},"",""]
[{"$nulls":7},"",""]
[{"$nulls":7},"",""]
[{"$nulls":7},"",""]
[{"$nulls":7},"",""]
[{"$nulls":7},"",""]
[{"$nulls":7},"",""]
[{"$nulls":7},"",""]
[{"$nulls":7},"",""]
[{"$nulls":7},"",""]
[{"$nulls":7},"",""]

{"sheet":"Space output","index":9,"n_rows":1109,"n_cols":255,"rows_kept":1109,"cut":false,"hidden":false,"merged":[[23,3,23,4],[23,5,23,6],[24,3,24,4],[24,5,24,6],[25,3,25,4],[25,5,25,6],[6,12,6,13],[21,5,21,6],[22,5,22,6],[19,3,19,4],[21,3,21,4],[22,3,22,4],[19,5,19,6],[20,5,20,6],[16,3,16,4],[20,3,20,4],[32,3,32,4],[32,5,32,6],[33,3,33,4],[33,5,33,6],[34,3,34,4],[34,5,34,6],[29,3,29,4],[29,5,29,6],[30,3,30,4],[30,5,30,6],[31,3,31,4],[31,5,31,6],[26,3,26,4],[26,5,26,6],[27,3,27,4],[27,5,27,6],[28,3,28,4],[28,5,28,6],[41,3,41,4],[41,5,41,6],[42,3,42,4],[42,5,42,6],[43,3,43,4],[43,5,43,6],[38,3,38,4],[38,5,38,6],[39,3,39,4],[39,5,39,6],[40,3,40,4],[40,5,40,6],[35,3,35,4],[35,5,35,6],[36,3,36,4],[36,5,36,6],[37,3,37,4],[37,5,37,6],[50,3,50,4],[50,5,50,6],[51,3,51,4],[51,5,51,6],[52,3,52,4],[52,5,52,6],[47,3,47,4],[47,5,47,6],[48,3,48,4],[48,5,48,6],[49,3,49,4],[49,5,49,6],[44,3,44,4],[44,5,44,6],[45,3,45,4],[45,5,45,6],[46,3,46,4],[46,5,46,6],[59,3,59,4],[59,5,59,6],[60,3,60,4],[60,5,60,6],[61,3,61,4],[61,5,61,6],[56,3,56,4],[56,5,56,6],[57,3,57,4],[57,5,57,6],[58,3,58,4],[58,5,58,6],[53,3,53,4],[53,5,53,6],[54,3,54,4],[54,5,54,6],[55,3,55,4],[55,5,55,6],[68,3,68,4],[68,5,68,6],[69,3,69,4],[69,5,69,6],[70,3,70,4],[70,5,70,6],[65,3,65,4],[65,5,65,6],[66,3,66,4],[66,5,66,6],[67,3,67,4],[67,5,67,6],[62,3,62,4],[62,5,62,6],[63,3,63,4],[63,5,63,6],[64,3,64,4],[64,5,64,6],[77,3,77,4],[77,5,77,6],[78,3,78,4],[78,5,78,6],[79,3,79,4],[79,5,79,6],[74,3,74,4],[74,5,74,6],[75,3,75,4],[75,5,75,6],[76,3,76,4],[76,5,76,6],[71,3,71,4],[71,5,71,6],[72,3,72,4],[72,5,72,6],[73,3,73,4],[73,5,73,6],[86,3,86,4],[86,5,86,6],[87,3,87,4],[87,5,87,6],[88,3,88,4],[88,5,88,6],[83,3,83,4],[83,5,83,6],[84,3,84,4],[84,5,84,6],[85,3,85,4],[85,5,85,6],[80,3,80,4],[80,5,80,6],[81,3,81,4],[81,5,81,6],[82,3,82,4],[82,5,82,6],[95,3,95,4],[95,5,95,6],[96,3,96,4],[96,5,96,6],[97,3,97,4],[97,5,97,6],[92,3,92,4],[92,5,92,6],[93,3,93,4],[93,5,93,6],[94,3,94,4],[94,5,94,6],[89,3,89,4],[89,5,89,6],[90,3,90,4],[90,5,90,6],[91,3,91,4],[91,5,91,6],[104,3,104,4],[104,5,104,6],[105,3,105,4],[105,5,105,6],[106,3,106,4],[106,5,106,6],[101,3,101,4],[101,5,101,6],[102,3,102,4],[102,5,102,6],[103,3,103,4],[103,5,103,6],[98,3,98,4],[98,5,98,6],[99,3,99,4],[99,5,99,6],[100,3,100,4],[100,5,100,6],[113,3,113,4],[113,5,113,6],[114,3,114,4],[114,5,114,6],[115,3,115,4],[115,5,115,6],[110,3,110,4],[110,5,110,6],[111,3,111,4],[111,5,111,6],[112,3,112,4],[112,5,112,6],[107,3,107,4],[107,5,107,6],[108,3,108,4],[108,5,108,6],[109,3,109,4],[109,5,109,6],[122,3,122,4],[122,5,122,6],[123,3,123,4],[123,5,123,6],[124,3,124,4],[124,5,124,6],[119,3,119,4],[119,5,119,6],[120,3,120,4],[120,5,120,6],[121,3,121,4],[121,5,121,6],[116,3,116,4],[116,5,116,6],[117,3,117,4],[117,5,117,6],[118,3,118,4],[118,5,118,6],[131,3,131,4],[131,5,131,6],[132,3,132,4],[132,5,132,6],[133,3,133,4],[133,5,133,6],[128,3,128,4],[128,5,128,6],[129,3,129,4],[129,5,129,6],[130,3,130,4],[130,5,130,6],[125,3,125,4],[125,5,125,6],[126,3,126,4],[126,5,126,6],[127,3,127,4],[127,5,127,6],[140,3,140,4],[140,5,140,6],[141,3,141,4],[141,5,141,6],[142,3,142,4],[142,5,142,6],[137,3,137,4],[137,5,137,6],[138,3,138,4],[138,5,138,6],[139,3,139,4],[139,5,139,6],[134,3,134,4],[134,5,134,6],[135,3,135,4],[135,5,135,6],[136,3,136,4],[136,5,136,6],[149,3,149,4],[149,5,149,6],[150,3,150,4],[150,5,150,6],[151,3,151,4],[151,5,151,6],[146,3,146,4],[146,5,146,6],[147,3,147,4],[147,5,147,6],[148,3,148,4],[148,5,148,6],[143,3,143,4],[143,5,143,6],[144,3,144,4],[144,5,144,6],[145,3,145,4],[145,5,145,6],[158,3,158,4],[158,5,158,6],[159,3,159,4],[159,5,159,6],[160,3,160,4],[160,5,160,6],[155,3,155,4],[155,5,155,6],[156,3,156,4],[156,5,156,6],[157,3,157,4],[157,5,157,6],[152,3,152,4],[152,5,152,6],[153,3,153,4],[153,5,153,6],[154,3,154,4],[154,5,154,6],[167,3,167,4],[167,5,167,6],[168,3,168,4],[168,5,168,6],[169,3,169,4],[169,5,169,6],[164,3,164,4],[164,5,164,6],[165,3,165,4],[165,5,165,6],[166,3,166,4],[166,5,166,6],[161,3,161,4],[161,5,161,6],[162,3,162,4],[162,5,162,6],[163,3,163,4],[163,5,163,6],[176,3,176,4],[176,5,176,6],[177,3,177,4],[177,5,177,6],[178,3,178,4],[178,5,178,6],[173,3,173,4],[173,5,173,6],[174,3,174,4],[174,5,174,6],[175,3,175,4],[175,5,175,6],[170,3,170,4],[170,5,170,6],[171,3,171,4],[171,5,171,6],[172,3,172,4],[172,5,172,6],[185,3,185,4],[185,5,185,6],[186,3,186,4],[186,5,186,6],[187,3,187,4],[187,5,187,6],[182,3,182,4],[182,5,182,6],[183,3,183,4],[183,5,183,6],[184,3,184,4],[184,5,184,6],[179,3,179,4],[179,5,179,6],[180,3,180,4],[180,5,180,6],[181,3,181,4],[181,5,181,6],[194,3,194,4],[194,5,194,6],[195,3,195,4],[195,5,195,6],[196,3,196,4],[196,5,196,6],[191,3,191,4],[191,5,191,6],[192,3,192,4],[192,5,192,6],[193,3,193,4],[193,5,193,6],[188,3,188,4],[188,5,188,6],[189,3,189,4],[189,5,189,6],[190,3,190,4],[190,5,190,6],[203,3,203,4],[203,5,203,6],[204,3,204,4],[204,5,204,6],[205,3,205,4],[205,5,205,6],[200,3,200,4],[200,5,200,6],[201,3,201,4],[201,5,201,6],[202,3,202,4],[202,5,202,6],[197,3,197,4],[197,5,197,6],[198,3,198,4],[198,5,198,6],[199,3,199,4],[199,5,199,6],[212,3,212,4],[212,5,212,6],[213,3,213,4],[213,5,213,6],[214,3,214,4],[214,5,214,6],[209,3,209,4],[209,5,209,6],[210,3,210,4],[210,5,210,6],[211,3,211,4],[211,5,211,6],[206,3,206,4],[206,5,206,6],[207,3,207,4],[207,5,207,6],[208,3,208,4],[208,5,208,6],[221,3,221,4],[221,5,221,6],[222,3,222,4],[222,5,222,6],[223,3,223,4],[223,5,223,6],[218,3,218,4],[218,5,218,6],[219,3,219,4],[219,5,219,6],[220,3,220,4],[220,5,220,6],[215,3,215,4],[215,5,215,6],[216,3,216,4],[216,5,216,6],[217,3,217,4],[217,5,217,6],[230,3,230,4],[230,5,230,6],[231,3,231,4],[231,5,231,6],[232,3,232,4],[232,5,232,6],[227,3,227,4],[227,5,227,6],[228,3,228,4],[228,5,228,6],[229,3,229,4],[229,5,229,6],[224,3,224,4],[224,5,224,6],[225,3,225,4],[225,5,225,6],[226,3,226,4],[226,5,226,6],[239,3,239,4],[239,5,239,6],[240,3,240,4],[240,5,240,6],[241,3,241,4],[241,5,241,6],[236,3,236,4],[236,5,236,6],[237,3,237,4],[237,5,237,6],[238,3,238,4],[238,5,238,6],[233,3,233,4],[233,5,233,6],[234,3,234,4],[234,5,234,6],[235,3,235,4],[235,5,235,6],[248,3,248,4],[248,5,248,6],[249,3,249,4],[249,5,249,6],[250,3,250,4],[250,5,250,6],[245,3,245,4],[245,5,245,6],[246,3,246,4],[246,5,246,6],[247,3,247,4],[247,5,247,6],[242,3,242,4],[242,5,242,6],[243,3,243,4],[243,5,243,6],[244,3,244,4],[244,5,244,6],[257,3,257,4],[257,5,257,6],[258,3,258,4],[258,5,258,6],[259,3,259,4],[259,5,259,6],[254,3,254,4],[254,5,254,6],[255,3,255,4],[255,5,255,6],[256,3,256,4],[256,5,256,6],[251,3,251,4],[251,5,251,6],[252,3,252,4],[252,5,252,6],[253,3,253,4],[253,5,253,6],[266,3,266,4],[266,5,266,6],[267,3,267,4],[267,5,267,6],[268,3,268,4],[268,5,268,6],[263,3,263,4],[263,5,263,6],[264,3,264,4],[264,5,264,6],[265,3,265,4],[265,5,265,6],[260,3,260,4],[260,5,260,6],[261,3,261,4],[261,5,261,6],[262,3,262,4],[262,5,262,6],[275,3,275,4],[275,5,275,6],[276,3,276,4],[276,5,276,6],[277,3,277,4],[277,5,277,6],[272,3,272,4],[272,5,272,6],[273,3,273,4],[273,5,273,6],[274,3,274,4],[274,5,274,6],[269,3,269,4],[269,5,269,6],[270,3,270,4],[270,5,270,6],[271,3,271,4],[271,5,271,6],[284,3,284,4],[284,5,284,6],[285,3,285,4],[285,5,285,6],[286,3,286,4],[286,5,286,6],[281,3,281,4],[281,5,281,6],[282,3,282,4],[282,5,282,6],[283,3,283,4],[283,5,283,6],[278,3,278,4],[278,5,278,6],[279,3,279,4],[279,5,279,6],[280,3,280,4],[280,5,280,6],[293,3,293,4],[293,5,293,6],[294,3,294,4],[294,5,294,6],[295,3,295,4],[295,5,295,6],[290,3,290,4],[290,5,290,6],[291,3,291,4],[291,5,291,6],[292,3,292,4],[292,5,292,6],[287,3,287,4],[287,5,287,6],[288,3,288,4],[288,5,288,6],[289,3,289,4],[289,5,289,6],[302,3,302,4],[302,5,302,6],[303,3,303,4],[303,5,303,6],[304,3,304,4],[304,5,304,6],[299,3,299,4],[299,5,299,6],[300,3,300,4],[300,5,300,6],[301,3,301,4],[301,5,301,6],[296,3,296,4],[296,5,296,6],[297,3,297,4],[297,5,297,6],[298,3,298,4],[298,5,298,6],[311,3,311,4],[311,5,311,6],[312,3,312,4],[312,5,312,6],[313,3,313,4],[313,5,313,6],[308,3,308,4],[308,5,308,6],[309,3,309,4],[309,5,309,6],[310,3,310,4],[310,5,310,6],[305,3,305,4],[305,5,305,6],[306,3,306,4],[306,5,306,6],[307,3,307,4],[307,5,307,6],[320,3,320,4],[320,5,320,6],[321,3,321,4],[321,5,321,6],[322,3,322,4],[322,5,322,6],[317,3,317,4],[317,5,317,6],[318,3,318,4],[318,5,318,6],[319,3,319,4],[319,5,319,6],[314,3,314,4],[314,5,314,6],[315,3,315,4],[315,5,315,6],[316,3,316,4],[316,5,316,6],[329,3,329,4],[329,5,329,6],[330,3,330,4],[330,5,330,6],[331,3,331,4],[331,5,331,6],[326,3,326,4],[326,5,326,6],[327,3,327,4],[327,5,327,6],[328,3,328,4],[328,5,328,6],[323,3,323,4],[323,5,323,6],[324,3,324,4],[324,5,324,6],[325,3,325,4],[325,5,325,6],[338,3,338,4],[338,5,338,6],[339,3,339,4],[339,5,339,6],[340,3,340,4],[340,5,340,6],[335,3,335,4],[335,5,335,6],[336,3,336,4],[336,5,336,6],[337,3,337,4],[337,5,337,6],[332,3,332,4],[332,5,332,6],[333,3,333,4],[333,5,333,6],[334,3,334,4],[334,5,334,6],[347,3,347,4],[347,5,347,6],[348,3,348,4],[348,5,348,6],[349,3,349,4],[349,5,349,6],[344,3,344,4],[344,5,344,6],[345,3,345,4],[345,5,345,6],[346,3,346,4],[346,5,346,6],[341,3,341,4],[341,5,341,6],[342,3,342,4],[342,5,342,6],[343,3,343,4],[343,5,343,6],[356,3,356,4],[356,5,356,6],[357,3,357,4],[357,5,357,6],[358,3,358,4],[358,5,358,6],[353,3,353,4],[353,5,353,6],[354,3,354,4],[354,5,354,6],[355,3,355,4],[355,5,355,6],[350,3,350,4],[350,5,350,6],[351,3,351,4],[351,5,351,6],[352,3,352,4],[352,5,352,6],[365,3,365,4],[365,5,365,6],[366,3,366,4],[366,5,366,6],[367,3,367,4],[367,5,367,6],[362,3,362,4],[362,5,362,6],[363,3,363,4],[363,5,363,6],[364,3,364,4],[364,5,364,6],[359,3,359,4],[359,5,359,6],[360,3,360,4],[360,5,360,6],[361,3,361,4],[361,5,361,6],[374,3,374,4],[374,5,374,6],[375,3,375,4],[375,5,375,6],[376,3,376,4],[376,5,376,6],[371,3,371,4],[371,5,371,6],[372,3,372,4],[372,5,372,6],[373,3,373,4],[373,5,373,6],[368,3,368,4],[368,5,368,6],[369,3,369,4],[369,5,369,6],[370,3,370,4],[370,5,370,6],[383,3,383,4],[383,5,383,6],[384,3,384,4],[384,5,384,6],[385,3,385,4],[385,5,385,6],[380,3,380,4],[380,5,380,6],[381,3,381,4],[381,5,381,6],[382,3,382,4],[382,5,382,6],[377,3,377,4],[377,5,377,6],[378,3,378,4],[378,5,378,6],[379,3,379,4],[379,5,379,6],[392,3,392,4],[392,5,392,6],[393,3,393,4],[393,5,393,6],[394,3,394,4],[394,5,394,6],[389,3,389,4],[389,5,389,6],[390,3,390,4],[390,5,390,6],[391,3,391,4],[391,5,391,6],[386,3,386,4],[386,5,386,6],[387,3,387,4],[387,5,387,6],[388,3,388,4],[388,5,388,6],[401,3,401,4],[401,5,401,6],[402,3,402,4],[402,5,402,6],[403,3,403,4],[403,5,403,6],[398,3,398,4],[398,5,398,6],[399,3,399,4],[399,5,399,6],[400,3,400,4],[400,5,400,6],[395,3,395,4],[395,5,395,6],[396,3,396,4],[396,5,396,6],[397,3,397,4],[397,5,397,6],[410,3,410,4],[410,5,410,6],[411,3,411,4],[411,5,411,6],[412,3,412,4],[412,5,412,6],[407,3,407,4],[407,5,407,6],[408,3,408,4],[408,5,408,6],[409,3,409,4],[409,5,409,6],[404,3,404,4],[404,5,404,6],[405,3,405,4],[405,5,405,6],[406,3,406,4],[406,5,406,6],[419,3,419,4],[419,5,419,6],[420,3,420,4],[420,5,420,6],[421,3,421,4],[421,5,421,6],[416,3,416,4],[416,5,416,6],[417,3,417,4],[417,5,417,6],[418,3,418,4],[418,5,418,6],[413,3,413,4],[413,5,413,6],[414,3,414,4],[414,5,414,6],[415,3,415,4],[415,5,415,6],[428,3,428,4],[428,5,428,6],[429,3,429,4],[429,5,429,6],[430,3,430,4],[430,5,430,6],[425,3,425,4],[425,5,425,6],[426,3,426,4],[426,5,426,6],[427,3,427,4],[427,5,427,6],[422,3,422,4],[422,5,422,6],[423,3,423,4],[423,5,423,6],[424,3,424,4],[424,5,424,6],[437,3,437,4],[437,5,437,6],[438,3,438,4],[438,5,438,6],[439,3,439,4],[439,5,439,6],[434,3,434,4],[434,5,434,6],[435,3,435,4],[435,5,435,6],[436,3,436,4],[436,5,436,6],[431,3,431,4],[431,5,431,6],[432,3,432,4],[432,5,432,6],[433,3,433,4],[433,5,433,6],[446,3,446,4],[446,5,446,6],[447,3,447,4],[447,5,447,6],[448,3,448,4],[448,5,448,6],[443,3,443,4],[443,5,443,6],[444,3,444,4],[444,5,444,6],[445,3,445,4],[445,5,445,6],[440,3,440,4],[440,5,440,6],[441,3,441,4],[441,5,441,6],[442,3,442,4],[442,5,442,6],[455,3,455,4],[455,5,455,6],[456,3,456,4],[456,5,456,6],[457,3,457,4],[457,5,457,6],[452,3,452,4],[452,5,452,6],[453,3,453,4],[453,5,453,6],[454,3,454,4],[454,5,454,6],[449,3,449,4],[449,5,449,6],[450,3,450,4],[450,5,450,6],[451,3,451,4],[451,5,451,6],[464,3,464,4],[464,5,464,6],[465,3,465,4],[465,5,465,6],[466,3,466,4],[466,5,466,6],[461,3,461,4],[461,5,461,6],[462,3,462,4],[462,5,462,6],[463,3,463,4],[463,5,463,6],[458,3,458,4],[458,5,458,6],[459,3,459,4],[459,5,459,6],[460,3,460,4],[460,5,460,6],[473,3,473,4],[473,5,473,6],[474,3,474,4],[474,5,474,6],[475,3,475,4],[475,5,475,6],[470,3,470,4],[470,5,470,6],[471,3,471,4],[471,5,471,6],[472,3,472,4],[472,5,472,6],[467,3,467,4],[467,5,467,6],[468,3,468,4],[468,5,468,6],[469,3,469,4],[469,5,469,6],[482,3,482,4],[482,5,482,6],[483,3,483,4],[483,5,483,6],[484,3,484,4],[484,5,484,6],[479,3,479,4],[479,5,479,6],[480,3,480,4],[480,5,480,6],[481,3,481,4],[481,5,481,6],[476,3,476,4],[476,5,476,6],[477,3,477,4],[477,5,477,6],[478,3,478,4],[478,5,478,6],[491,3,491,4],[491,5,491,6],[492,3,492,4],[492,5,492,6],[493,3,493,4],[493,5,493,6],[488,3,488,4],[488,5,488,6],[489,3,489,4],[489,5,489,6],[490,3,490,4],[490,5,490,6],[485,3,485,4],[485,5,485,6],[486,3,486,4],[486,5,486,6],[487,3,487,4],[487,5,487,6],[500,3,500,4],[500,5,500,6],[501,3,501,4],[501,5,501,6],[502,3,502,4],[502,5,502,6],[497,3,497,4],[497,5,497,6],[498,3,498,4],[498,5,498,6],[499,3,499,4],[499,5,499,6],[494,3,494,4],[494,5,494,6],[495,3,495,4],[495,5,495,6],[496,3,496,4],[496,5,496,6],[509,3,509,4],[509,5,509,6],[510,3,510,4],[510,5,510,6],[511,3,511,4],[511,5,511,6],[506,3,506,4],[506,5,506,6],[507,3,507,4],[507,5,507,6],[508,3,508,4],[508,5,508,6],[503,3,503,4],[503,5,503,6],[504,3,504,4],[504,5,504,6],[505,3,505,4],[505,5,505,6],[518,3,518,4],[518,5,518,6],[519,3,519,4],[519,5,519,6],[520,3,520,4],[520,5,520,6],[515,3,515,4],[515,5,515,6],[516,3,516,4],[516,5,516,6],[517,3,517,4],[517,5,517,6]],"merged_total":1204,"flags":["merged_cut"]}
[{"$nulls":231},"DROP DOWN MENU PAGES",{"$nulls":4},"AREAS WITHIN THE SITE",null,null,null,"SPACING DESCRIPTION",null,null,null,"WEEKNUMBERS",null,null,null,"SITE OR ENVIRONMENT TYPE (HIGHEST LEVEL OF DIFFERENTIATION)",null,null,null,"AREAS"]
[{"$nulls":11},"Go to  "]
[]
[{"$nulls":231},"Production stage",{"$nulls":4},"Name",null,null,null,"Spacing description",null,null,null,"Week numbers",null,null,null,"Main area names",null,null,null,"Name"]
[null,"Actions to be performed on (multiple) batches",{"$nulls":234},{"$f":"IF('Data entry form'!CQ5<>\"\",'Data entry form'!CQ5,\"\")","v":"No change"},null,null,null,{"$f":"'Data entry form'!CL5","v":"No change"},null,null,null,"No change",null,null,null,{"$f":"IF('Data entry form'!BU5=\"\",\"\",'Data entry form'!BU5)","v":"No change"},null,null,null,{"$f":"IF('Data entry form'!CA5=\"\",\"\",'Data entry form'!CA5)","v":"No change"}]
[{"$nulls":231},"Data entry form",{"$nulls":8},{"$f":"IF('Data entry form'!CL6=\"\",\"\",'Data entry form'!CL6)","v":""},null,null,null,{"$f":"'Data entry form'!FQ7","v":"2/2011"},null,null,null,{"$f":"IF('Data entry form'!BU6=\"\",\"\",'Data entry form'!BU6)","v":""},null,null,null,{"$f":"IF('Data entry form'!CA6=\"\",\"\",'Data entry form'!CA6)","v":""}]
[null,null,"?",null,"Select week number for actions",{"$nulls":4},"Number of units per batch",{"$nulls":5},"Stage 1",null,null,"Stage 6",{"$nulls":212},"Search",{"$nulls":8},{"$f":"IF('Data entry form'!CL7=\"\",\"\",'Data entry form'!CL7)","v":""},null,null,null,{"$f":"'Data entry form'!FQ8","v":"3/2011"},null,null,null,{"$f":"IF('Data entry form'!BU7=\"\",\"\",'Data entry form'!BU7)","v":""},null,null,null,{"$f":"IF('Data entry form'!CA7=\"\",\"\",'Data entry form'!CA7)","v":""}]
[{"$nulls":15},"Stage 2",null,null,"Stage 7",{"$nulls":212},"Selection",{"$nulls":8},{"$f":"IF('Data entry form'!CL8=\"\",\"\",'Data entry form'!CL8)","v":""},null,null,null,{"$f":"'Data entry form'!FQ9","v":"4/2011"},null,null,null,{"$f":"IF('Data entry form'!BU8=\"\",\"\",'Data entry form'!BU8)","v":""},null,null,null,{"$f":"IF('Data entry form'!CA8=\"\",\"\",'Data entry form'!CA8)","v":""}]
[null,null,"?",null,"Select destination site for move",{"$nulls":4},"Select batch-spacing description",{"$nulls":5},"Stage 3",null,null,"Stage 8",{"$nulls":212},"Actions",{"$nulls":8},{"$f":"IF('Data entry form'!CL9=\"\",\"\",'Data entry form'!CL9)","v":""},null,null,null,{"$f":"'Data entry form'!FQ10","v":"5/2011"},null,null,null,{"$f":"IF('Data entry form'!BU9=\"\",\"\",'Data entry form'!BU9)","v":""},null,null,null,{"$f":"IF('Data entry form'!CA9=\"\",\"\",'Data entry form'!CA9)","v":""}]
[{"$nulls":15},"Stage 4",null,null,"Stage 9",{"$nulls":212},"Actions summary",{"$nulls":8},{"$f":"IF('Data entry form'!CL10=\"\",\"\",'Data entry form'!CL10)","v":""},null,null,null,{"$f":"'Data entry form'!FQ11","v":"6/2011"},null,null,null,{"$f":"IF('Data entry form'!BU10=\"\",\"\",'Data entry form'!BU10)","v":""},null,null,null,{"$f":"IF('Data entry form'!CA10=\"\",\"\",'Data entry form'!CA10)","v":""}]
[null,null,"?",null,"Select destination area for move",{"$nulls":4},"Only for Final stage for sale ",{"$nulls":5},"Stage 5",null,null,"Final stage for sale  ",{"$nulls":212},"Unique code summary",{"$nulls":8},{"$f":"IF('Data entry form'!CL11=\"\",\"\",'Data entry form'!CL11)","v":""},null,null,null,{"$f":"'Data entry form'!FQ12","v":"7/2011"},null,null,null,{"$f":"IF('Data entry form'!BU11=\"\",\"\",'Data entry form'!BU11)","v":""},null,null,null,{"$f":"IF('Data entry form'!CA11=\"\",\"\",'Data entry form'!CA11)","v":""}]
[{"$nulls":9},"Select new ending week-number",{"$nulls":221},"Import data",{"$nulls":8},{"$f":"IF('Data entry form'!CL12=\"\",\"\",'Data entry form'!CL12)","v":""},null,null,null,{"$f":"'Data entry form'!FQ13","v":"8/2011"},null,null,null,{"$f":"IF('Data entry form'!BU12=\"\",\"\",'Data entry form'!BU12)","v":""},null,null,null,{"$f":"IF('Data entry form'!CA12=\"\",\"\",'Data entry form'!CA12)","v":""}]
[{"$nulls":231},"Imported selection",{"$nulls":8},{"$f":"IF('Data entry form'!CL13=\"\",\"\",'Data entry form'!CL13)","v":""},null,null,null,{"$f":"'Data entry form'!FQ14","v":"9/2011"},null,null,null,{"$f":"IF('Data entry form'!BU13=\"\",\"\",'Data entry form'!BU13)","v":""},null,null,null,{"$f":"IF('Data entry form'!CA13=\"\",\"\",'Data entry form'!CA13)","v":""}]
[{"$nulls":6},"Week no. ",{"$nulls":224},"Space output",{"$nulls":8},{"$f":"IF('Data entry form'!CL14=\"\",\"\",'Data entry form'!CL14)","v":""},null,null,null,{"$f":"'Data entry form'!FQ15","v":"10/2011"},null,null,null,{"$f":"IF('Data entry form'!BU14=\"\",\"\",'Data entry form'!BU14)","v":""},null,null,null,{"$f":"IF('Data entry form'!CA14=\"\",\"\",'Data entry form'!CA14)","v":""}]
[{"$nulls":6},"Week no. start date",{"$nulls":224},"Nursery summary report",{"$nulls":8},{"$f":"IF('Data entry form'!CL15=\"\",\"\",'Data entry form'!CL15)","v":""},null,null,null,{"$f":"'Data entry form'!FQ16","v":"11/2011"},null,null,null,{"$f":"IF('Data entry form'!BU15=\"\",\"\",'Data entry form'!BU15)","v":""},null,null,null,{"$f":"IF('Data entry form'!CA15=\"\",\"\",'Data entry form'!CA15)","v":""}]
[{"$nulls":6},"Occupied capacity  ",{"$nulls":224},"Stage 1",{"$nulls":8},{"$f":"IF('Data entry form'!CL16=\"\",\"\",'Data entry form'!CL16)","v":""},null,null,null,{"$f":"'Data entry form'!FQ17","v":"12/2011"},null,null,null,{"$f":"IF('Data entry form'!BU16=\"\",\"\",'Data entry form'!BU16)","v":""},null,null,null,{"$f":"IF('Data entry form'!CA16=\"\",\"\",'Data entry form'!CA16)","v":""},null,{"$f":"MAX(H16:HL16)","v":0}]
[{"$nulls":5},"m2","Capacity ",{"$nulls":224},"Final stage for sale",{"$nulls":8},{"$f":"IF('Data entry form'!CL17=\"\",\"\",'Data entry form'!CL17)","v":""},null,null,null,{"$f":"'Data entry form'!FQ18","v":"13/2011"},null,null,null,{"$f":"IF('Data entry form'!BU17=\"\",\"\",'Data entry form'!BU17)","v":""},null,null,null,{"$f":"IF('Data entry form'!CA17=\"\",\"\",'Data entry form'!CA17)","v":""}]
[{"$nulls":231},"Stage 2",{"$nulls":8},{"$f":"IF('Data entry form'!CL18=\"\",\"\",'Data entry form'!CL18)","v":""},null,null,null,{"$f":"'Data entry form'!FQ19","v":"14/2011"},null,null,null,{"$f":"IF('Data entry form'!BU18=\"\",\"\",'Data entry form'!BU18)","v":""},null,null,null,{"$f":"IF('Data entry form'!CA18=\"\",\"\",'Data entry form'!CA18)","v":""}]
[null,null,null,"Species / variety name",null,"Unique batch code",{"$nulls":225},"Stage 3",{"$nulls":8},{"$f":"IF('Data entry form'!CL19=\"\",\"\",'Data entry form'!CL19)","v":""},null,null,null,{"$f":"'Data entry form'!FQ20","v":"15/2011"},null,null,null,{"$f":"IF('Data entry form'!BU19=\"\",\"\",'Data entry form'!BU19)","v":""},null,null,null,{"$f":"IF('Data entry form'!CA19=\"\",\"\",'Data entry form'!CA19)","v":""}]
[{"$nulls":231},"Stage 4",{"$nulls":8},{"$f":"IF('Data entry form'!CL20=\"\",\"\",'Data entry form'!CL20)","v":""},null,null,null,{"$f":"'Data entry form'!FQ21","v":"16/2011"},null,null,null,{"$f":"IF('Data entry form'!BU20=\"\",\"\",'Data entry form'!BU20)","v":""},null,null,null,{"$f":"IF('Data entry form'!CA20=\"\",\"\",'Data entry form'!CA20)","v":""}]
[{"$nulls":231},"Stage 5",{"$nulls":8},{"$f":"IF('Data entry form'!CL21=\"\",\"\",'Data entry form'!CL21)","v":""},null,null,null,{"$f":"'Data entry form'!FQ22","v":"17/2011"},null,null,null,{"$f":"IF('Data entry form'!BU21=\"\",\"\",'Data entry form'!BU21)","v":""},null,null,null,{"$f":"IF('Data entry form'!CA21=\"\",\"\",'Data entry form'!CA21)","v":""}]
[{"$nulls":231},"Stage 6",{"$nulls":8},{"$f":"IF('Data entry form'!CL22=\"\",\"\",'Data entry form'!CL22)","v":""},null,null,null,{"$f":"'Data entry form'!FQ23","v":"18/2011"},null,null,null,{"$f":"IF('Data entry form'!BU22=\"\",\"\",'Data entry form'!BU22)","v":""},null,null,null,{"$f":"IF('Data entry form'!CA22=\"\",\"\",'Data entry form'!CA22)","v":""}]
[{"$nulls":231},"Stage 7",{"$nulls":8},{"$f":"IF('Data entry form'!CL23=\"\",\"\",'Data entry form'!CL23)","v":""},null,null,null,{"$f":"'Data entry form'!FQ24","v":"19/2011"},null,null,null,{"$f":"IF('Data entry form'!BU23=\"\",\"\",'Data entry form'!BU23)","v":""},null,null,null,{"$f":"IF('Data entry form'!CA23=\"\",\"\",'Data entry form'!CA23)","v":""}]
[{"$nulls":231},"Stage 8",{"$nulls":8},{"$f":"IF('Data entry form'!CL24=\"\",\"\",'Data entry form'!CL24)","v":""},null,null,null,{"$f":"'Data entry form'!FQ25","v":"20/2011"},null,null,null,{"$f":"IF('Data entry form'!BU24=\"\",\"\",'Data entry form'!BU24)","v":""},null,null,null,{"$f":"IF('Data entry form'!CA24=\"\",\"\",'Data entry form'!CA24)","v":""}]
[{"$nulls":231},"Stage 9",{"$nulls":8},{"$f":"IF('Data entry form'!CL25=\"\",\"\",'Data entry form'!CL25)","v":""},null,null,null,{"$f":"'Data entry form'!FQ26","v":"21/2011"},null,null,null,{"$f":"IF('Data entry form'!BU25=\"\",\"\",'Data entry form'!BU25)","v":""},null,null,null,{"$f":"IF('Data entry form'!CA25=\"\",\"\",'Data entry form'!CA25)","v":""}]
[{"$nulls":231},"Menu",{"$nulls":8},{"$f":"IF('Data entry form'!CL26=\"\",\"\",'Data entry form'!CL26)","v":""},null,null,null,{"$f":"'Data entry form'!FQ27","v":"22/2011"},null,null,null,{"$f":"IF('Data entry form'!BU26=\"\",\"\",'Data entry form'!BU26)","v":""},null,null,null,{"$f":"IF('Data entry form'!CA26=\"\",\"\",'Data entry form'!CA26)","v":""}]
[{"$nulls":231},"User guide",{"$nulls":8},{"$f":"IF('Data entry form'!CL27=\"\",\"\",'Data entry form'!CL27)","v":""},null,null,null,{"$f":"'Data entry form'!FQ28","v":"23/2011"},null,null,null,{"$f":"IF('Data entry form'!BU27=\"\",\"\",'Data entry form'!BU27)","v":""},null,null,null,{"$f":"IF('Data entry form'!CA27=\"\",\"\",'Data entry form'!CA27)","v":""}]
[{"$nulls":231},"Contact us",{"$nulls":8},{"$f":"IF('Data entry form'!CL28=\"\",\"\",'Data entry form'!CL28)","v":""},null,null,null,{"$f":"'Data entry form'!FQ29","v":"24/2011"},null,null,null,{"$f":"IF('Data entry form'!BU28=\"\",\"\",'Data entry form'!BU28)","v":""},null,null,null,{"$f":"IF('Data entry form'!CA28=\"\",\"\",'Data entry form'!CA28)","v":""}]
[{"$nulls":231},"Nursery details",{"$nulls":8},{"$f":"IF('Data entry form'!CL29=\"\",\"\",'Data entry form'!CL29)","v":""},null,null,null,{"$f":"'Data entry form'!FQ30","v":"25/2011"},null,null,null,{"$f":"IF('Data entry form'!BU29=\"\",\"\",'Data entry form'!BU29)","v":""},null,null,null,{"$f":"IF('Data entry form'!CA29=\"\",\"\",'Data entry form'!CA29)","v":""}]
[{"$nulls":240},{"$f":"IF('Data entry form'!CL30=\"\",\"\",'Data entry form'!CL30)","v":""},null,null,null,{"$f":"'Data entry form'!FQ31","v":"26/2011"},null,null,null,{"$f":"IF('Data entry form'!BU30=\"\",\"\",'Data entry form'!BU30)","v":""},null,null,null,{"$f":"IF('Data entry form'!CA30=\"\",\"\",'Data entry form'!CA30)","v":""}]
[{"$nulls":240},{"$f":"IF('Data entry form'!CL31=\"\",\"\",'Data entry form'!CL31)","v":""},null,null,null,{"$f":"'Data entry form'!FQ32","v":"27/2011"},null,null,null,{"$f":"IF('Data entry form'!BU31=\"\",\"\",'Data entry form'!BU31)","v":""},null,null,null,{"$f":"IF('Data entry form'!CA31=\"\",\"\",'Data entry form'!CA31)","v":""}]
[{"$nulls":240},{"$f":"IF('Data entry form'!CL32=\"\",\"\",'Data entry form'!CL32)","v":""},null,null,null,{"$f":"'Data entry form'!FQ33","v":"28/2011"},null,null,null,{"$f":"IF('Data entry form'!BU32=\"\",\"\",'Data entry form'!BU32)","v":""},null,null,null,{"$f":"IF('Data entry form'!CA32=\"\",\"\",'Data entry form'!CA32)","v":""}]
[{"$nulls":240},{"$f":"IF('Data entry form'!CL33=\"\",\"\",'Data entry form'!CL33)","v":""},null,null,null,{"$f":"'Data entry form'!FQ34","v":"29/2011"},null,null,null,{"$f":"IF('Data entry form'!BU33=\"\",\"\",'Data entry form'!BU33)","v":""},null,null,null,{"$f":"IF('Data entry form'!CA33=\"\",\"\",'Data entry form'!CA33)","v":""}]
[{"$nulls":240},{"$f":"IF('Data entry form'!CL34=\"\",\"\",'Data entry form'!CL34)","v":""},null,null,null,{"$f":"'Data entry form'!FQ35","v":"30/2011"},null,null,null,{"$f":"IF('Data entry form'!BU34=\"\",\"\",'Data entry form'!BU34)","v":""},null,null,null,{"$f":"IF('Data entry form'!CA34=\"\",\"\",'Data entry form'!CA34)","v":""}]
[{"$nulls":240},{"$f":"IF('Data entry form'!CL35=\"\",\"\",'Data entry form'!CL35)","v":""},null,null,null,{"$f":"'Data entry form'!FQ36","v":"31/2011"},null,null,null,{"$f":"IF('Data entry form'!BU35=\"\",\"\",'Data entry form'!BU35)","v":""},null,null,null,{"$f":"IF('Data entry form'!CA35=\"\",\"\",'Data entry form'!CA35)","v":""}]
[{"$nulls":240},{"$f":"IF('Data entry form'!CL36=\"\",\"\",'Data entry form'!CL36)","v":""},null,null,null,{"$f":"'Data entry form'!FQ37","v":"32/2011"},null,null,null,{"$f":"IF('Data entry form'!BU36=\"\",\"\",'Data entry form'!BU36)","v":""},null,null,null,{"$f":"IF('Data entry form'!CA36=\"\",\"\",'Data entry form'!CA36)","v":""}]
[{"$nulls":240},{"$f":"IF('Data entry form'!CL37=\"\",\"\",'Data entry form'!CL37)","v":""},null,null,null,{"$f":"'Data entry form'!FQ38","v":"33/2011"},null,null,null,{"$f":"IF('Data entry form'!BU39=\"\",\"\",'Data entry form'!BU39)","v":""},null,null,null,{"$f":"IF('Data entry form'!CA39=\"\",\"\",'Data entry form'!CA39)","v":""}]
[null,null,null,"",null,"",{"$nulls":234},{"$f":"IF('Data entry form'!CL38=\"\",\"\",'Data entry form'!CL38)","v":""},null,null,null,{"$f":"'Data entry form'!FQ39","v":"34/2011"},null,null,null,{"$f":"IF('Data entry form'!BU40=\"\",\"\",'Data entry form'!BU40)","v":""},null,null,null,{"$f":"IF('Data entry form'!CA40=\"\",\"\",'Data entry form'!CA40)","v":""}]
[null,null,null,"",null,"",{"$nulls":234},{"$f":"IF('Data entry form'!CL39=\"\",\"\",'Data entry form'!CL39)","v":""},null,null,null,{"$f":"'Data entry form'!FQ40","v":"35/2011"},null,null,null,{"$f":"IF('Data entry form'!BU41=\"\",\"\",'Data entry form'!BU41)","v":""},null,null,null,{"$f":"IF('Data entry form'!CA41=\"\",\"\",'Data entry form'!CA41)","v":""}]
[null,null,null,"",null,"",{"$nulls":234},{"$f":"IF('Data entry form'!CL40=\"\",\"\",'Data entry form'!CL40)","v":""},null,null,null,{"$f":"'Data entry form'!FQ41","v":"36/2011"},null,null,null,{"$f":"IF('Data entry form'!BU42=\"\",\"\",'Data entry form'!BU42)","v":""},null,null,null,{"$f":"IF('Data entry form'!CA42=\"\",\"\",'Data entry form'!CA42)","v":""}]
[null,null,null,"",null,"",{"$nulls":234},{"$f":"IF('Data entry form'!CL41=\"\",\"\",'Data entry form'!CL41)","v":""},null,null,null,{"$f":"'Data entry form'!FQ42","v":"37/2011"},null,null,null,{"$f":"IF('Data entry form'!BU43=\"\",\"\",'Data entry form'!BU43)","v":""},null,null,null,{"$f":"IF('Data entry form'!CA43=\"\",\"\",'Data entry form'!CA43)","v":""}]
[null,null,null,"",null,"",{"$nulls":234},{"$f":"IF('Data entry form'!CL42=\"\",\"\",'Data entry form'!CL42)","v":""},null,null,null,{"$f":"'Data entry form'!FQ43","v":"38/2011"},null,null,null,{"$f":"IF('Data entry form'!BU44=\"\",\"\",'Data entry form'!BU44)","v":""},null,null,null,{"$f":"IF('Data entry form'!CA44=\"\",\"\",'Data entry form'!CA44)","v":""}]
[null,null,null,"",null,"",{"$nulls":234},{"$f":"IF('Data entry form'!CL43=\"\",\"\",'Data entry form'!CL43)","v":""},null,null,null,{"$f":"'Data entry form'!FQ44","v":"39/2011"},null,null,null,{"$f":"IF('Data entry form'!BU45=\"\",\"\",'Data entry form'!BU45)","v":""},null,null,null,{"$f":"IF('Data entry form'!CA45=\"\",\"\",'Data entry form'!CA45)","v":""}]
[null,null,null,"",null,"",{"$nulls":234},{"$f":"IF('Data entry form'!CL44=\"\",\"\",'Data entry form'!CL44)","v":""},null,null,null,{"$f":"'Data entry form'!FQ45","v":"40/2011"},null,null,null,{"$f":"IF('Data entry form'!BU46=\"\",\"\",'Data entry form'!BU46)","v":""},null,null,null,{"$f":"IF('Data entry form'!CA46=\"\",\"\",'Data entry form'!CA46)","v":""}]
[null,null,null,"",null,"",{"$nulls":234},{"$f":"IF('Data entry form'!CL45=\"\",\"\",'Data entry form'!CL45)","v":""},null,null,null,{"$f":"'Data entry form'!FQ46","v":"41/2011"},null,null,null,{"$f":"IF('Data entry form'!BU47=\"\",\"\",'Data entry form'!BU47)","v":""},null,null,null,{"$f":"IF('Data entry form'!CA47=\"\",\"\",'Data entry form'!CA47)","v":""}]
[null,null,null,"",null,"",{"$nulls":234},{"$f":"IF('Data entry form'!CL46=\"\",\"\",'Data entry form'!CL46)","v":""},null,null,null,{"$f":"'Data entry form'!FQ47","v":"42/2011"},null,null,null,{"$f":"IF('Data entry form'!BU48=\"\",\"\",'Data entry form'!BU48)","v":""},null,null,null,{"$f":"IF('Data entry form'!CA48=\"\",\"\",'Data entry form'!CA48)","v":""}]
[null,null,null,"",null,"",{"$nulls":234},{"$f":"IF('Data entry form'!CL47=\"\",\"\",'Data entry form'!CL47)","v":""},null,null,null,{"$f":"'Data entry form'!FQ48","v":"43/2011"},null,null,null,{"$f":"IF('Data entry form'!BU49=\"\",\"\",'Data entry form'!BU49)","v":""},null,null,null,{"$f":"IF('Data entry form'!CA49=\"\",\"\",'Data entry form'!CA49)","v":""}]
[null,null,null,"",null,"",{"$nulls":234},{"$f":"IF('Data entry form'!CL48=\"\",\"\",'Data entry form'!CL48)","v":""},null,null,null,{"$f":"'Data entry form'!FQ49","v":"44/2011"},null,null,null,{"$f":"IF('Data entry form'!BU50=\"\",\"\",'Data entry form'!BU50)","v":""},null,null,null,{"$f":"IF('Data entry form'!CA50=\"\",\"\",'Data entry form'!CA50)","v":""}]
[null,null,null,"",null,"",{"$nulls":234},{"$f":"IF('Data entry form'!CL49=\"\",\"\",'Data entry form'!CL49)","v":""},null,null,null,{"$f":"'Data entry form'!FQ50","v":"45/2011"},null,null,null,{"$f":"IF('Data entry form'!BU51=\"\",\"\",'Data entry form'!BU51)","v":""},null,null,null,{"$f":"IF('Data entry form'!CA51=\"\",\"\",'Data entry form'!CA51)","v":""}]
[null,null,null,"",null,"",{"$nulls":234},{"$f":"IF('Data entry form'!CL50=\"\",\"\",'Data entry form'!CL50)","v":""},null,null,null,{"$f":"'Data entry form'!FQ51","v":"46/2011"},null,null,null,{"$f":"IF('Data entry form'!BU52=\"\",\"\",'Data entry form'!BU52)","v":""},null,null,null,{"$f":"IF('Data entry form'!CA52=\"\",\"\",'Data entry form'!CA52)","v":""}]
[null,null,null,"",null,"",{"$nulls":234},{"$f":"IF('Data entry form'!CL51=\"\",\"\",'Data entry form'!CL51)","v":""},null,null,null,{"$f":"'Data entry form'!FQ52","v":"47/2011"},null,null,null,{"$f":"IF('Data entry form'!BU53=\"\",\"\",'Data entry form'!BU53)","v":""},null,null,null,{"$f":"IF('Data entry form'!CA53=\"\",\"\",'Data entry form'!CA53)","v":""}]
[null,null,null,"",null,"",{"$nulls":234},{"$f":"IF('Data entry form'!CL52=\"\",\"\",'Data entry form'!CL52)","v":""},null,null,null,{"$f":"'Data entry form'!FQ53","v":"48/2011"},null,null,null,{"$f":"IF('Data entry form'!BU54=\"\",\"\",'Data entry form'!BU54)","v":""},null,null,null,{"$f":"IF('Data entry form'!CA54=\"\",\"\",'Data entry form'!CA54)","v":""}]
[null,null,null,"",null,"",{"$nulls":234},{"$f":"IF('Data entry form'!CL53=\"\",\"\",'Data entry form'!CL53)","v":""},null,null,null,{"$f":"'Data entry form'!FQ54","v":"49/2011"},null,null,null,{"$f":"IF('Data entry form'!BU55=\"\",\"\",'Data entry form'!BU55)","v":""},null,null,null,{"$f":"IF('Data entry form'!CA55=\"\",\"\",'Data entry form'!CA55)","v":""}]
[null,null,null,"",null,"",{"$nulls":234},{"$f":"IF('Data entry form'!CL54=\"\",\"\",'Data entry form'!CL54)","v":""},null,null,null,{"$f":"'Data entry form'!FQ55","v":"50/2011"},null,null,null,{"$f":"IF('Data entry form'!BU56=\"\",\"\",'Data entry form'!BU56)","v":""},null,null,null,{"$f":"IF('Data entry form'!CA56=\"\",\"\",'Data entry form'!CA56)","v":""}]
[null,null,null,"",null,"",{"$nulls":234},{"$f":"IF('Data entry form'!CL55=\"\",\"\",'Data entry form'!CL55)","v":""},null,null,null,{"$f":"'Data entry form'!FQ56","v":"51/2011"},null,null,null,{"$f":"IF('Data entry form'!BU57=\"\",\"\",'Data entry form'!BU57)","v":""},null,null,null,{"$f":"IF('Data entry form'!CA57=\"\",\"\",'Data entry form'!CA57)","v":""}]
[null,null,null,"",null,"",{"$nulls":234},{"$f":"IF('Data entry form'!CL56=\"\",\"\",'Data entry form'!CL56)","v":""},null,null,null,{"$f":"'Data entry form'!FQ57","v":"52/2011"},null,null,null,{"$f":"IF('Data entry form'!BU58=\"\",\"\",'Data entry form'!BU58)","v":""},null,null,null,{"$f":"IF('Data entry form'!CA58=\"\",\"\",'Data entry form'!CA58)","v":""}]
[null,null,null,"",null,"",{"$nulls":234},{"$f":"IF('Data entry form'!CL57=\"\",\"\",'Data entry form'!CL57)","v":""},null,null,null,{"$f":"'Data entry form'!FQ58","v":"1/2012"},null,null,null,{"$f":"IF('Data entry form'!BU59=\"\",\"\",'Data entry form'!BU59)","v":""},null,null,null,{"$f":"IF('Data entry form'!CA59=\"\",\"\",'Data entry form'!CA59)","v":""}]
[null,null,null,"",null,"",{"$nulls":234},{"$f":"IF('Data entry form'!CL58=\"\",\"\",'Data entry form'!CL58)","v":""},null,null,null,{"$f":"'Data entry form'!FQ59","v":"2/2012"}]
[null,null,null,"",null,"",{"$nulls":234},{"$f":"IF('Data entry form'!CL59=\"\",\"\",'Data entry form'!CL59)","v":""},null,null,null,{"$f":"'Data entry form'!FQ60","v":"3/2012"}]
[null,null,null,"",null,"",{"$nulls":238},{"$f":"'Data entry form'!FQ61","v":"4/2012"}]
[null,null,null,"",null,"",{"$nulls":238},{"$f":"'Data entry form'!FQ62","v":"5/2012"}]
[null,null,null,"",null,"",{"$nulls":238},{"$f":"'Data entry form'!FQ63","v":"6/2012"}]
[null,null,null,"",null,"",{"$nulls":238},{"$f":"'Data entry form'!FQ64","v":"7/2012"}]
[null,null,null,"",null,"",{"$nulls":238},{"$f":"'Data entry form'!FQ65","v":"8/2012"}]
[null,null,null,"",null,"",{"$nulls":238},{"$f":"'Data entry form'!FQ66","v":"9/2012"}]
[null,null,null,"",null,"",{"$nulls":238},{"$f":"'Data entry form'!FQ67","v":"10/2012"}]
[null,null,null,"",null,"",{"$nulls":238},{"$f":"'Data entry form'!FQ68","v":"11/2012"}]
[null,null,null,"",null,"",{"$nulls":238},{"$f":"'Data entry form'!FQ69","v":"12/2012"}]
[null,null,null,"",null,"",{"$nulls":238},{"$f":"'Data entry form'!FQ70","v":"13/2012"}]
[null,null,null,"",null,"",{"$nulls":238},{"$f":"'Data entry form'!FQ71","v":"14/2012"}]
[null,null,null,"",null,"",{"$nulls":238},{"$f":"'Data entry form'!FQ72","v":"15/2012"}]
[null,null,null,"",null,"",{"$nulls":238},{"$f":"'Data entry form'!FQ73","v":"16/2012"}]
[null,null,null,"",null,"",{"$nulls":238},{"$f":"'Data entry form'!FQ74","v":"17/2012"}]
[null,null,null,"",null,"",{"$nulls":238},{"$f":"'Data entry form'!FQ75","v":"18/2012"}]
[null,null,null,"",null,"",{"$nulls":238},{"$f":"'Data entry form'!FQ76","v":"19/2012"}]
[null,null,null,"",null,"",{"$nulls":238},{"$f":"'Data entry form'!FQ77","v":"20/2012"}]
[null,null,null,"",null,"",{"$nulls":238},{"$f":"'Data entry form'!FQ78","v":"21/2012"}]
[null,null,null,"",null,"",{"$nulls":238},{"$f":"'Data entry form'!FQ79","v":"22/2012"}]
[null,null,null,"",null,"",{"$nulls":238},{"$f":"'Data entry form'!FQ80","v":"23/2012"}]
[null,null,null,"",null,"",{"$nulls":238},{"$f":"'Data entry form'!FQ81","v":"24/2012"}]
[null,null,null,"",null,"",{"$nulls":238},{"$f":"'Data entry form'!FQ82","v":"25/2012"}]
[null,null,null,"",null,"",{"$nulls":238},{"$f":"'Data entry form'!FQ83","v":"26/2012"}]
[null,null,null,"",null,"",{"$nulls":238},{"$f":"'Data entry form'!FQ84","v":"27/2012"}]
[null,null,null,"",null,"",{"$nulls":238},{"$f":"'Data entry form'!FQ85","v":"28/2012"}]
[null,null,null,"",null,"",{"$nulls":238},{"$f":"'Data entry form'!FQ86","v":"29/2012"}]
[null,null,null,"",null,"",{"$nulls":238},{"$f":"'Data entry form'!FQ87","v":"30/2012"}]
[null,null,null,"",null,"",{"$nulls":238},{"$f":"'Data entry form'!FQ88","v":"31/2012"}]
[null,null,null,"",null,"",{"$nulls":238},{"$f":"'Data entry form'!FQ89","v":"32/2012"}]
[null,null,null,"",null,"",{"$nulls":238},{"$f":"'Data entry form'!FQ90","v":"33/2012"}]
[null,null,null,"",null,"",{"$nulls":238},{"$f":"'Data entry form'!FQ91","v":"34/2012"}]
[null,null,null,"",null,"",{"$nulls":238},{"$f":"'Data entry form'!FQ92","v":"35/2012"}]
[null,null,null,"",null,"",{"$nulls":238},{"$f":"'Data entry form'!FQ93","v":"36/2012"}]
[null,null,null,"",null,"",{"$nulls":238},{"$f":"'Data entry form'!FQ94","v":"37/2012"}]
[null,null,null,"",null,"",{"$nulls":238},{"$f":"'Data entry form'!FQ95","v":"38/2012"}]
[null,null,null,"",null,"",{"$nulls":238},{"$f":"'Data entry form'!FQ96","v":"39/2012"}]
[null,null,null,"",null,"",{"$nulls":238},{"$f":"'Data entry form'!FQ97","v":"40/2012"}]
[null,null,null,"",null,"",{"$nulls":238},{"$f":"'Data entry form'!FQ98","v":"41/2012"}]
[null,null,null,"",null,"",{"$nulls":238},{"$f":"'Data entry form'!FQ99","v":"42/2012"}]
[null,null,null,"",null,"",{"$nulls":238},{"$f":"'Data entry form'!FQ100","v":"43/2012"}]
[null,null,null,"",null,"",{"$nulls":238},{"$f":"'Data entry form'!FQ101","v":"44/2012"}]
[null,null,null,"",null,"",{"$nulls":238},{"$f":"'Data entry form'!FQ102","v":"45/2012"}]
[null,null,null,"",null,"",{"$nulls":238},{"$f":"'Data entry form'!FQ103","v":"46/2012"}]
[null,null,null,"",null,"",{"$nulls":238},{"$f":"'Data entry form'!FQ104","v":"47/2012"}]
[null,null,null,"",null,"",{"$nulls":238},{"$f":"'Data entry form'!FQ105","v":"48/2012"}]
[null,null,null,"",null,"",{"$nulls":238},{"$f":"'Data entry form'!FQ106","v":"49/2012"}]
[null,null,null,"",null,"",{"$nulls":238},{"$f":"'Data entry form'!FQ107","v":"50/2012"}]
[null,null,null,"",null,"",{"$nulls":238},{"$f":"'Data entry form'!FQ108","v":"51/2012"}]
[null,null,null,"",null,"",{"$nulls":238},{"$f":"'Data entry form'!FQ109","v":"52/2012"}]
[null,null,null,"",null,"",{"$nulls":238},{"$f":"'Data entry form'!FQ110","v":"1/2013"}]
[null,null,null,"",null,"",{"$nulls":238},{"$f":"'Data entry form'!FQ111","v":"2/2013"}]
[null,null,null,"",null,"",{"$nulls":238},{"$f":"'Data entry form'!FQ112","v":"3/2013"}]
[null,null,null,"",null,"",{"$nulls":238},{"$f":"'Data entry form'!FQ113","v":"4/2013"}]
[null,null,null,"",null,"",{"$nulls":238},{"$f":"'Data entry form'!FQ114","v":"5/2013"}]
[null,null,null,"",null,"",{"$nulls":238},{"$f":"'Data entry form'!FQ115","v":"6/2013"}]
[null,null,null,"",null,"",{"$nulls":238},{"$f":"'Data entry form'!FQ116","v":"7/2013"}]
[null,null,null,"",null,"",{"$nulls":238},{"$f":"'Data entry form'!FQ117","v":"8/2013"}]
[null,null,null,"",null,"",{"$nulls":238},{"$f":"'Data entry form'!FQ118","v":"9/2013"}]
[null,null,null,"",null,"",{"$nulls":238},{"$f":"'Data entry form'!FQ119","v":"10/2013"}]
[null,null,null,"",null,"",{"$nulls":238},{"$f":"'Data entry form'!FQ120","v":"11/2013"}]
[null,null,null,"",null,"",{"$nulls":238},{"$f":"'Data entry form'!FQ121","v":"12/2013"}]
[null,null,null,"",null,"",{"$nulls":238},{"$f":"'Data entry form'!FQ122","v":"13/2013"}]
[null,null,null,"",null,"",{"$nulls":238},{"$f":"'Data entry form'!FQ123","v":"14/2013"}]
[null,null,null,"",null,"",{"$nulls":238},{"$f":"'Data entry form'!FQ124","v":"15/2013"}]
[null,null,null,"",null,"",{"$nulls":238},{"$f":"'Data entry form'!FQ125","v":"16/2013"}]
[null,null,null,"",null,"",{"$nulls":238},{"$f":"'Data entry form'!FQ126","v":"17/2013"}]
[null,null,null,"",null,"",{"$nulls":238},{"$f":"'Data entry form'!FQ127","v":"18/2013"}]
[null,null,null,"",null,"",{"$nulls":238},{"$f":"'Data entry form'!FQ128","v":"19/2013"}]
[null,null,null,"",null,"",{"$nulls":238},{"$f":"'Data entry form'!FQ129","v":"20/2013"}]
[null,null,null,"",null,"",{"$nulls":238},{"$f":"'Data entry form'!FQ130","v":"21/2013"}]
[null,null,null,"",null,"",{"$nulls":238},{"$f":"'Data entry form'!FQ131","v":"22/2013"}]
[null,null,null,"",null,"",{"$nulls":238},{"$f":"'Data entry form'!FQ132","v":"23/2013"}]
[null,null,null,"",null,"",{"$nulls":238},{"$f":"'Data entry form'!FQ133","v":"24/2013"}]
[null,null,null,"",null,"",{"$nulls":238},{"$f":"'Data entry form'!FQ134","v":"25/2013"}]
[null,null,null,"",null,"",{"$nulls":238},{"$f":"'Data entry form'!FQ135","v":"26/2013"}]
[null,null,null,"",null,"",{"$nulls":238},{"$f":"'Data entry form'!FQ136","v":"27/2013"}]
[null,null,null,"",null,"",{"$nulls":238},{"$f":"'Data entry form'!FQ137","v":"28/2013"}]
[null,null,null,"",null,"",{"$nulls":238},{"$f":"'Data entry form'!FQ138","v":"29/2013"}]
[null,null,null,"",null,"",{"$nulls":238},{"$f":"'Data entry form'!FQ139","v":"30/2013"}]
[null,null,null,"",null,"",{"$nulls":238},{"$f":"'Data entry form'!FQ140","v":"31/2013"}]
[null,null,null,"",null,"",{"$nulls":238},{"$f":"'Data entry form'!FQ141","v":"32/2013"}]
[null,null,null,"",null,"",{"$nulls":238},{"$f":"'Data entry form'!FQ142","v":"33/2013"}]
[null,null,null,"",null,"",{"$nulls":238},{"$f":"'Data entry form'!FQ143","v":"34/2013"}]
[null,null,null,"",null,"",{"$nulls":238},{"$f":"'Data entry form'!FQ144","v":"35/2013"}]
[null,null,null,"",null,"",{"$nulls":238},{"$f":"'Data entry form'!FQ145","v":"36/2013"}]
[null,null,null,"",null,"",{"$nulls":238},{"$f":"'Data entry form'!FQ146","v":"37/2013"}]
[null,null,null,"",null,"",{"$nulls":238},{"$f":"'Data entry form'!FQ147","v":"38/2013"}]
[null,null,null,"",null,"",{"$nulls":238},{"$f":"'Data entry form'!FQ148","v":"39/2013"}]
[null,null,null,"",null,"",{"$nulls":238},{"$f":"'Data entry form'!FQ149","v":"40/2013"}]
[null,null,null,"",null,"",{"$nulls":238},{"$f":"'Data entry form'!FQ150","v":"41/2013"}]
[null,null,null,"",null,"",{"$nulls":238},{"$f":"'Data entry form'!FQ151","v":"42/2013"}]
[null,null,null,"",null,"",{"$nulls":238},{"$f":"'Data entry form'!FQ152","v":"43/2013"}]
[null,null,null,"",null,"",{"$nulls":238},{"$f":"'Data entry form'!FQ153","v":"44/2013"}]
[null,null,null,"",null,"",{"$nulls":238},{"$f":"'Data entry form'!FQ154","v":"45/2013"}]
[null,null,null,"",null,"",{"$nulls":238},{"$f":"'Data entry form'!FQ155","v":"46/2013"}]
[null,null,null,"",null,"",{"$nulls":238},{"$f":"'Data entry form'!FQ156","v":"47/2013"}]
[null,null,null,"",null,"",{"$nulls":238},{"$f":"'Data entry form'!FQ157","v":"48/2013"}]
[null,null,null,"",null,"",{"$nulls":238},{"$f":"'Data entry form'!FQ158","v":"49/2013"}]
[null,null,null,"",null,"",{"$nulls":238},{"$f":"'Data entry form'!FQ159","v":"50/2013"}]
[null,null,null,"",null,"",{"$nulls":238},{"$f":"'Data entry form'!FQ160","v":"51/2013"}]
[null,null,null,"",null,"",{"$nulls":238},{"$f":"'Data entry form'!FQ161","v":"52/2013"}]
[null,null,null,"",null,"",{"$nulls":238},{"$f":"'Data entry form'!FQ162","v":"1/2014"}]
[null,null,null,"",null,"",{"$nulls":238},{"$f":"'Data entry form'!FQ163","v":"2/2014"}]
[null,null,null,"",null,"",{"$nulls":238},{"$f":"'Data entry form'!FQ164","v":"3/2014"}]
[null,null,null,"",null,"",{"$nulls":238},{"$f":"'Data entry form'!FQ165","v":"4/2014"}]
[null,null,null,"",null,"",{"$nulls":238},{"$f":"'Data entry form'!FQ166","v":"5/2014"}]
[null,null,null,"",null,"",{"$nulls":238},{"$f":"'Data entry form'!FQ167","v":"6/2014"}]
[null,null,null,"",null,"",{"$nulls":238},{"$f":"'Data entry form'!FQ168","v":"7/2014"}]
[null,null,null,"",null,"",{"$nulls":238},{"$f":"'Data entry form'!FQ169","v":"8/2014"}]
[null,null,null,"",null,"",{"$nulls":238},{"$f":"'Data entry form'!FQ170","v":"9/2014"}]
[null,null,null,"",null,"",{"$nulls":238},{"$f":"'Data entry form'!FQ171","v":"10/2014"}]
[null,null,null,"",null,"",{"$nulls":238},{"$f":"'Data entry form'!FQ172","v":"11/2014"}]
[null,null,null,"",null,"",{"$nulls":238},{"$f":"'Data entry form'!FQ173","v":"12/2014"}]
[null,null,null,"",null,"",{"$nulls":238},{"$f":"'Data entry form'!FQ174","v":"13/2014"}]
[null,null,null,"",null,"",{"$nulls":238},{"$f":"'Data entry form'!FQ175","v":"14/2014"}]
[null,null,null,"",null,"",{"$nulls":238},{"$f":"'Data entry form'!FQ176","v":"15/2014"}]
[null,null,null,"",null,"",{"$nulls":238},{"$f":"'Data entry form'!FQ177","v":"16/2014"}]
[null,null,null,"",null,"",{"$nulls":238},{"$f":"'Data entry form'!FQ178","v":"17/2014"}]
[null,null,null,"",null,"",{"$nulls":238},{"$f":"'Data entry form'!FQ179","v":"18/2014"}]
[null,null,null,"",null,"",{"$nulls":238},{"$f":"'Data entry form'!FQ180","v":"19/2014"}]
[null,null,null,"",null,"",{"$nulls":238},{"$f":"'Data entry form'!FQ181","v":"20/2014"}]
[null,null,null,"",null,"",{"$nulls":238},{"$f":"'Data entry form'!FQ182","v":"21/2014"}]
[null,null,null,"",null,"",{"$nulls":238},{"$f":"'Data entry form'!FQ183","v":"22/2014"}]
[null,null,null,"",null,"",{"$nulls":238},{"$f":"'Data entry form'!FQ184","v":"23/2014"}]
[null,null,null,"",null,"",{"$nulls":238},{"$f":"'Data entry form'!FQ185","v":"24/2014"}]
[null,null,null,"",null,"",{"$nulls":238},{"$f":"'Data entry form'!FQ186","v":"25/2014"}]
[null,null,null,"",null,"",{"$nulls":238},{"$f":"'Data entry form'!FQ187","v":"26/2014"}]
[null,null,null,"",null,"",{"$nulls":238},{"$f":"'Data entry form'!FQ188","v":"27/2014"}]
[null,null,null,"",null,"",{"$nulls":238},{"$f":"'Data entry form'!FQ189","v":"28/2014"}]
[null,null,null,"",null,"",{"$nulls":238},{"$f":"'Data entry form'!FQ190","v":"29/2014"}]
[null,null,null,"",null,"",{"$nulls":238},{"$f":"'Data entry form'!FQ191","v":"30/2014"}]
[null,null,null,"",null,"",{"$nulls":238},{"$f":"'Data entry form'!FQ192","v":"31/2014"}]
[null,null,null,"",null,"",{"$nulls":238},{"$f":"'Data entry form'!FQ193","v":"32/2014"}]
[null,null,null,"",null,"",{"$nulls":238},{"$f":"'Data entry form'!FQ194","v":"33/2014"}]
[null,null,null,"",null,"",{"$nulls":238},{"$f":"'Data entry form'!FQ195","v":"34/2014"}]
[null,null,null,"",null,"",{"$nulls":238},{"$f":"'Data entry form'!FQ196","v":"35/2014"}]
[null,null,null,"",null,"",{"$nulls":238},{"$f":"'Data entry form'!FQ197","v":"36/2014"}]
[null,null,null,"",null,"",{"$nulls":238},{"$f":"'Data entry form'!FQ198","v":"37/2014"}]
[null,null,null,"",null,"",{"$nulls":238},{"$f":"'Data entry form'!FQ199","v":"38/2014"}]
[null,null,null,"",null,"",{"$nulls":238},{"$f":"'Data entry form'!FQ200","v":"39/2014"}]
[null,null,null,"",null,"",{"$nulls":238},{"$f":"'Data entry form'!FQ201","v":"40/2014"}]
[null,null,null,"",null,"",{"$nulls":238},{"$f":"'Data entry form'!FQ202","v":"41/2014"}]
[null,null,null,"",null,"",{"$nulls":238},{"$f":"'Data entry form'!FQ203","v":"42/2014"}]
[null,null,null,"",null,"",{"$nulls":238},{"$f":"'Data entry form'!FQ204","v":"43/2014"}]
[null,null,null,"",null,"",{"$nulls":238},{"$f":"'Data entry form'!FQ205","v":"44/2014"}]
[null,null,null,"",null,"",{"$nulls":238},{"$f":"'Data entry form'!FQ206","v":"45/2014"}]
[null,null,null,"",null,"",{"$nulls":238},{"$f":"'Data entry form'!FQ207","v":"46/2014"}]
[null,null,null,"",null,"",{"$nulls":238},{"$f":"'Data entry form'!FQ208","v":"47/2014"}]
[null,null,null,"",null,"",{"$nulls":238},{"$f":"'Data entry form'!FQ209","v":"48/2014"}]
[null,null,null,"",null,"",{"$nulls":238},{"$f":"'Data entry form'!FQ210","v":"49/2014"}]
[null,null,null,"",null,"",{"$nulls":238},{"$f":"'Data entry form'!FQ211","v":"50/2014"}]
[null,null,null,"",null,"",{"$nulls":238},{"$f":"'Data entry form'!FQ212","v":"51/2014"}]
[null,null,null,"",null,"",{"$nulls":238},{"$f":"'Data entry form'!FQ213","v":"52/2014"}]
[null,null,null,"",null,"",{"$nulls":238},{"$f":"'Data entry form'!FQ214","v":"1/2015"}]
[null,null,null,"",null,"",{"$nulls":238},{"$f":"'Data entry form'!FQ215","v":"2/2015"}]
[null,null,null,"",null,"",{"$nulls":238},{"$f":"'Data entry form'!FQ216","v":"3/2015"}]
[null,null,null,"",null,"",{"$nulls":238},{"$f":"'Data entry form'!FQ217","v":"4/2015"}]
[null,null,null,"",null,"",{"$nulls":238},{"$f":"'Data entry form'!FQ218","v":"5/2015"}]
[null,null,null,"",null,""]
[null,null,null,"",null,""]
[null,null,null,"",null,""]
[null,null,null,"",null,""]
[null,null,null,"",null,""]
[null,null,null,"",null,""]
[null,null,null,"",null,""]
[null,null,null,"",null,""]
[null,null,null,"",null,""]
[null,null,null,"",null,""]
[null,null,null,"",null,""]
[null,null,null,"",null,""]
[null,null,null,"",null,""]
[null,null,null,"",null,""]
[null,null,null,"",null,""]
[null,null,null,"",null,""]
[null,null,null,"",null,""]
[null,null,null,"",null,""]
[null,null,null,"",null,""]
[null,null,null,"",null,""]
[null,null,null,"",null,""]
[null,null,null,"",null,""]
[null,null,null,"",null,""]
[null,null,null,"",null,""]
[null,null,null,"",null,""]
[null,null,null,"",null,""]
[null,null,null,"",null,""]
[null,null,null,"",null,""]
[null,null,null,"",null,""]
[null,null,null,"",null,""]
[null,null,null,"",null,""]
[null,null,null,"",null,""]
[null,null,null,"",null,""]
[null,null,null,"",null,""]
[null,null,null,"",null,""]
[null,null,null,"",null,""]
[null,null,null,"",null,""]
[null,null,null,"",null,""]
[null,null,null,"",null,""]
[null,null,null,"",null,""]
[null,null,null,"",null,""]
[null,null,null,"",null,""]
[null,null,null,"",null,""]
[null,null,null,"",null,""]
[null,null,null,"",null,""]
[null,null,null,"",null,""]
[null,null,null,"",null,""]
[null,null,null,"",null,""]
[null,null,null,"",null,""]
[null,null,null,"",null,""]
[null,null,null,"",null,""]
[null,null,null,"",null,""]
[null,null,null,"",null,""]
[null,null,null,"",null,""]
[null,null,null,"",null,""]
[null,null,null,"",null,""]
[null,null,null,"",null,""]
[null,null,null,"",null,""]
[null,null,null,"",null,""]
[null,null,null,"",null,""]
[null,null,null,"",null,""]
[null,null,null,"",null,""]
[null,null,null,"",null,""]
[null,null,null,"",null,""]
[null,null,null,"",null,""]
[null,null,null,"",null,""]
[null,null,null,"",null,""]
[null,null,null,"",null,""]
[null,null,null,"",null,""]
[null,null,null,"",null,""]
[null,null,null,"",null,""]
[null,null,null,"",null,""]
[null,null,null,"",null,""]
[null,null,null,"",null,""]
[null,null,null,"",null,""]
[null,null,null,"",null,""]
[null,null,null,"",null,""]
[null,null,null,"",null,""]
[null,null,null,"",null,""]
[null,null,null,"",null,""]
[null,null,null,"",null,""]
[null,null,null,"",null,""]
[null,null,null,"",null,""]
[null,null,null,"",null,""]
[null,null,null,"",null,""]
[null,null,null,"",null,""]
[null,null,null,"",null,""]
[null,null,null,"",null,""]
[null,null,null,"",null,""]
[null,null,null,"",null,""]
[null,null,null,"",null,""]
[null,null,null,"",null,""]
[null,null,null,"",null,""]
[null,null,null,"",null,""]
[null,null,null,"",null,""]
[null,null,null,"",null,""]
[null,null,null,"",null,""]
[null,null,null,"",null,""]
[null,null,null,"",null,""]
[null,null,null,"",null,""]
[null,null,null,"",null,""]
[null,null,null,"",null,""]
[null,null,null,"",null,""]
[null,null,null,"",null,""]
[null,null,null,"",null,""]
[null,null,null,"",null,""]
[null,null,null,"",null,""]
[null,null,null,"",null,""]
[null,null,null,"",null,""]
[null,null,null,"",null,""]
[null,null,null,"",null,""]
[null,null,null,"",null,""]
[null,null,null,"",null,""]
[null,null,null,"",null,""]
[null,null,null,"",null,""]
[null,null,null,"",null,""]
[null,null,null,"",null,""]
[null,null,null,"",null,""]
[null,null,null,"",null,""]
[null,null,null,"",null,""]
[null,null,null,"",null,""]
[null,null,null,"",null,""]
[null,null,null,"",null,""]
[null,null,null,"",null,""]
[null,null,null,"",null,""]
[null,null,null,"",null,""]
[null,null,null,"",null,""]
[null,null,null,"",null,""]
[null,null,null,"",null,""]
[null,null,null,"",null,""]
[null,null,null,"",null,""]
[null,null,null,"",null,""]
[null,null,null,"",null,""]
[null,null,null,"",null,""]
[null,null,null,"",null,""]
[null,null,null,"",null,""]
[null,null,null,"",null,""]
[null,null,null,"",null,""]
[null,null,null,"",null,""]
[null,null,null,"",null,""]
[null,null,null,"",null,""]
[null,null,null,"",null,""]
[null,null,null,"",null,""]
[null,null,null,"",null,""]
[null,null,null,"",null,""]
[null,null,null,"",null,""]
[null,null,null,"",null,""]
[null,null,null,"",null,""]
[null,null,null,"",null,""]
[null,null,null,"",null,""]
[null,null,null,"",null,""]
[null,null,null,"",null,""]
[null,null,null,"",null,""]
[null,null,null,"",null,""]
[null,null,null,"",null,""]
[null,null,null,"",null,""]
[null,null,null,"",null,""]
[null,null,null,"",null,""]
[null,null,null,"",null,""]
[null,null,null,"",null,""]
[null,null,null,"",null,""]
[null,null,null,"",null,""]
[null,null,null,"",null,""]
[null,null,null,"",null,""]
[null,null,null,"",null,""]
[null,null,null,"",null,""]
[null,null,null,"",null,""]
[null,null,null,"",null,""]
[null,null,null,"",null,""]
[null,null,null,"",null,""]
[null,null,null,"",null,""]
[null,null,null,"",null,""]
[null,null,null,"",null,""]
[null,null,null,"",null,""]
[null,null,null,"",null,""]
[null,null,null,"",null,""]
[null,null,null,"",null,""]
[null,null,null,"",null,""]
[null,null,null,"",null,""]
[null,null,null,"",null,""]
[null,null,null,"",null,""]
[null,null,null,"",null,""]
[null,null,null,"",null,""]
[null,null,null,"",null,""]
[null,null,null,"",null,""]
[null,null,null,"",null,""]
[null,null,null,"",null,""]
[null,null,null,"",null,""]
[null,null,null,"",null,""]
[null,null,null,"",null,""]
[null,null,null,"",null,""]
[null,null,null,"",null,""]
[null,null,null,"",null,""]
[null,null,null,"",null,""]
[null,null,null,"",null,""]
[null,null,null,"",null,""]
[null,null,null,"",null,""]
[null,null,null,"",null,""]
[null,null,null,"",null,""]
[null,null,null,"",null,""]
[null,null,null,"",null,""]
[null,null,null,"",null,""]
[null,null,null,"",null,""]
[null,null,null,"",null,""]
[null,null,null,"",null,""]
[null,null,null,"",null,""]
[null,null,null,"",null,""]
[null,null,null,"",null,""]
[null,null,null,"",null,""]
[null,null,null,"",null,""]
[null,null,null,"",null,""]
[null,null,null,"",null,""]
[null,null,null,"",null,""]
[null,null,null,"",null,""]
[null,null,null,"",null,""]
[null,null,null,"",null,""]
[null,null,null,"",null,""]
[null,null,null,"",null,""]
[null,null,null,"",null,""]
[null,null,null,"",null,""]
[null,null,null,"",null,""]
[null,null,null,"",null,""]
[null,null,null,"",null,""]
[null,null,null,"",null,""]
[null,null,null,"",null,""]
[null,null,null,"",null,""]
[null,null,null,"",null,""]
[null,null,null,"",null,""]
[null,null,null,"",null,""]
[null,null,null,"",null,""]
[null,null,null,"",null,""]
[null,null,null,"",null,""]
[null,null,null,"",null,""]
[null,null,null,"",null,""]
[null,null,null,"",null,""]
[null,null,null,"",null,""]
[null,null,null,"",null,""]
[null,null,null,"",null,""]
[null,null,null,"",null,""]
[null,null,null,"",null,""]
[null,null,null,"",null,""]
[null,null,null,"",null,""]
[null,null,null,"",null,""]
[null,null,null,"",null,""]
[null,null,null,"",null,""]
[null,null,null,"",null,""]
[null,null,null,"",null,""]
[null,null,null,"",null,""]
[null,null,null,"",null,""]
[null,null,null,"",null,""]
[null,null,null,"",null,""]
[null,null,null,"",null,""]
[null,null,null,"",null,""]
[null,null,null,"",null,""]
[null,null,null,"",null,""]
[null,null,null,"",null,""]
[null,null,null,"",null,""]
[null,null,null,"",null,""]
[null,null,null,"",null,""]
[null,null,null,"",null,""]
[null,null,null,"",null,""]
[null,null,null,"",null,""]
[null,null,null,"",null,""]
[null,null,null,"",null,""]
[null,null,null,"",null,""]
[null,null,null,"",null,""]
[null,null,null,"",null,""]
[null,null,null,"",null,""]
[null,null,null,"",null,""]
[null,null,null,"",null,""]
[null,null,null,"",null,""]
[null,null,null,"",null,""]
[null,null,null,"",null,""]
[null,null,null,"",null,""]
[null,null,null,"",null,""]
[null,null,null,"",null,""]
[null,null,null,"",null,""]
[null,null,null,"",null,""]
[null,null,null,"",null,""]
[null,null,null,"",null,""]
[null,null,null,"",null,""]
[null,null,null,"",null,""]
[null,null,null,"",null,""]
[null,null,null,"",null,""]
[null,null,null,"",null,""]
[null,null,null,"",null,""]
[null,null,null,"",null,""]
[null,null,null,"",null,""]
[null,null,null,"",null,""]
[null,null,null,"",null,""]
[null,null,null,"",null,""]
[null,null,null,"",null,""]
[null,null,null,"",null,""]
[null,null,null,"",null,""]
[null,null,null,"",null,""]
[null,null,null,"",null,""]
[null,null,null,"",null,""]
[null,null,null,"",null,""]
[null,null,null,"",null,""]
[null,null,null,"",null,""]
[null,null,null,"",null,""]
[null,null,null,"",null,""]
[null,null,null,"",null,""]
[null,null,null,"",null,""]
[null,null,null,"",null,""]
[null,null,null,"",null,""]
[null,null,null,"",null,""]
[null,null,null,"",null,""]
[null,null,null,"",null,""]
[null,null,null,"",null,""]
[null,null,null,"",null,""]
[null,null,null,"",null,""]
[null,null,null,"",null,""]
[null,null,null,"",null,""]
[null,null,null,"",null,""]
[null,null,null,"",null,""]
[null,null,null,"",null,""]
[null,null,null,"",null,""]
[null,null,null,"",null,""]
[null,null,null,"",null,""]
[null,null,null,"",null,""]
[null,null,null,"",null,""]
[null,null,null,"",null,""]
[null,null,null,"",null,""]
[null,null,null,"",null,""]
[null,null,null,"",null,""]
[null,null,null,"",null,""]
[null,null,null,"",null,""]
[null,null,null,"",null,""]
[null,null,null,"",null,""]
[null,null,null,"",null,""]
[null,null,null,"",null,""]
[null,null,null,"",null,""]
[null,null,null,"",null,""]
[null,null,null,"",null,""]
[null,null,null,"",null,""]
[null,null,null,"",null,""]
[null,null,null,"",null,""]
[null,null,null,"",null,""]
[null,null,null,"",null,""]
[null,null,null,"",null,""]
[null,null,null,"",null,""]
[null,null,null,"",null,""]
[null,null,null,"",null,""]
[null,null,null,"",null,""]
[null,null,null,"",null,""]
[null,null,null,"",null,""]
[null,null,null,"",null,""]
[null,null,null,"",null,""]
[null,null,null,"",null,""]
[null,null,null,"",null,""]
[null,null,null,"",null,""]
[null,null,null,"",null,""]
[null,null,null,"",null,""]
[null,null,null,"",null,""]
[null,null,null,"",null,""]
[null,null,null,"",null,""]
[null,null,null,"",null,""]
[null,null,null,"",null,""]
[null,null,null,"",null,""]
[null,null,null,"",null,""]
[null,null,null,"",null,""]
[null,null,null,"",null,""]
[null,null,null,"",null,""]
[null,null,null,"",null,""]
[null,null,null,"",null,""]
[null,null,null,"",null,""]
[null,null,null,"",null,""]
[null,null,null,"",null,""]
[null,null,null,"",null,""]
[null,null,null,"",null,""]
[null,null,null,"",null,""]
[null,null,null,"",null,""]
[null,null,null,"",null,""]
[null,null,null,"",null,""]
[null,null,null,"",null,""]
[null,null,null,"",null,""]
[null,null,null,"",null,""]
[null,null,null,"",null,""]
[null,null,null,"",null,""]
[null,null,null,"",null,""]
[null,null,null,"",null,""]
[null,null,null,"",null,""]
[null,null,null,"",null,""]
[null,null,null,"",null,""]
[null,null,null,"",null,""]
[null,null,null,"",null,""]
[null,null,null,"",null,""]
[null,null,null,"",null,""]
[null,null,null,"",null,""]
[null,null,null,"",null,""]
[null,null,null,"",null,""]
[null,null,null,"",null,""]
[null,null,null,"",null,""]
[null,null,null,"",null,""]
[null,null,null,"",null,""]
[null,null,null,"",null,""]
[null,null,null,"",null,""]
[null,null,null,"",null,""]
[null,null,null,"",null,""]
[null,null,null,"",null,""]
[null,null,null,"",null,""]
[null,null,null,"","",""]
[null,null,null,"","",""]
[null,null,null,"","",""]
[null,null,null,"","",""]
[null,null,null,"","",""]
[null,null,null,"","",""]
[null,null,null,"","",""]
[null,null,null,"","",""]
[null,null,null,"","",""]
[null,null,null,"","",""]
[null,null,null,"","",""]
[null,null,null,"","",""]
[null,null,null,"","",""]
[null,null,null,"","",""]
[null,null,null,"","",""]
[null,null,null,"","",""]
[null,null,null,"","",""]
[null,null,null,"","",""]
[null,null,null,"","",""]
[null,null,null,"","",""]
[null,null,null,"","",""]
[null,null,null,"","",""]
[null,null,null,"","",""]
[null,null,null,"","",""]
[null,null,null,"","",""]
[null,null,null,"","",""]
[null,null,null,"","",""]
[null,null,null,"","",""]
[null,null,null,"","",""]
[null,null,null,"","",""]
[null,null,null,"","",""]
[null,null,null,"","",""]
[null,null,null,"","",""]
[null,null,null,"","",""]
[null,null,null,"","",""]
[null,null,null,"","",""]
[null,null,null,"","",""]
[null,null,null,"","",""]
[null,null,null,"","",""]
[null,null,null,"","",""]
[null,null,null,"","",""]
[null,null,null,"","",""]
[null,null,null,"","",""]
[null,null,null,"","",""]
[null,null,null,"","",""]
[null,null,null,"","",""]
[null,null,null,"","",""]
[null,null,null,"","",""]
[null,null,null,"","",""]
[null,null,null,"","",""]
[null,null,null,"","",""]
[null,null,null,"","",""]
[null,null,null,"","",""]
[null,null,null,"","",""]
[null,null,null,"","",""]
[null,null,null,"","",""]
[null,null,null,"","",""]
[null,null,null,"","",""]
[null,null,null,"","",""]
[null,null,null,"","",""]
[null,null,null,"","",""]
[null,null,null,"","",""]
[null,null,null,"","",""]
[null,null,null,"","",""]
[null,null,null,"","",""]
[null,null,null,"","",""]
[null,null,null,"","",""]
[null,null,null,"","",""]
[null,null,null,"","",""]
[null,null,null,"","",""]
[null,null,null,"","",""]
[null,null,null,"","",""]
[null,null,null,"","",""]
[null,null,null,"","",""]
[null,null,null,"","",""]
[null,null,null,"","",""]
[null,null,null,"","",""]
[null,null,null,"","",""]
[null,null,null,"","",""]
[null,null,null,"","",""]
[null,null,null,"","",""]
[null,null,null,"","",""]
[null,null,null,"","",""]
[null,null,null,"","",""]
[null,null,null,"","",""]
[null,null,null,"","",""]
[null,null,null,"","",""]
[null,null,null,"","",""]
[null,null,null,"","",""]
[null,null,null,"","",""]
[null,null,null,"","",""]
[null,null,null,"","",""]
[null,null,null,"","",""]
[null,null,null,"","",""]
[null,null,null,"","",""]
[null,null,null,"","",""]
[null,null,null,"","",""]
[null,null,null,"","",""]
[null,null,null,"","",""]
[null,null,null,"","",""]
[null,null,null,"","",""]
[null,null,null,"","",""]
[null,null,null,"","",""]
[null,null,null,"","",""]
[null,null,null,"","",""]
[null,null,null,"","",""]
[null,null,null,"","",""]
[null,null,null,"","",""]
[null,null,null,"","",""]
[null,null,null,"","",""]
[null,null,null,"","",""]
[null,null,null,"","",""]
[null,null,null,"","",""]
[null,null,null,"","",""]
[null,null,null,"","",""]
[null,null,null,"","",""]
[null,null,null,"","",""]
[null,null,null,"","",""]
[null,null,null,"","",""]
[null,null,null,"","",""]
[null,null,null,"","",""]
[null,null,null,"","",""]
[null,null,null,"","",""]
[null,null,null,"","",""]
[null,null,null,"","",""]
[null,null,null,"","",""]
[null,null,null,"","",""]
[null,null,null,"","",""]
[null,null,null,"","",""]
[null,null,null,"","",""]
[null,null,null,"","",""]
[null,null,null,"","",""]
[null,null,null,"","",""]
[null,null,null,"","",""]
[null,null,null,"","",""]
[null,null,null,"","",""]
[null,null,null,"","",""]
[null,null,null,"","",""]
[null,null,null,"","",""]
[null,null,null,"","",""]
[null,null,null,"","",""]
[null,null,null,"","",""]
[null,null,null,"","",""]
[null,null,null,"","",""]
[null,null,null,"","",""]
[null,null,null,"","",""]
[null,null,null,"","",""]
[null,null,null,"","",""]
[null,null,null,"","",""]
[null,null,null,"","",""]
[null,null,null,"","",""]
[null,null,null,"","",""]
[null,null,null,"","",""]
[null,null,null,"","",""]
[null,null,null,"","",""]
[null,null,null,"","",""]
[null,null,null,"","",""]
[null,null,null,"","",""]
[null,null,null,"","",""]
[null,null,null,"","",""]
[null,null,null,"","",""]
[null,null,null,"","",""]
[null,null,null,"","",""]
[null,null,null,"","",""]
[null,null,null,"","",""]
[null,null,null,"","",""]
[null,null,null,"","",""]
[null,null,null,"","",""]
[null,null,null,"","",""]
[null,null,null,"","",""]
[null,null,null,"","",""]
[null,null,null,"","",""]
[null,null,null,"","",""]
[null,null,null,"","",""]
[null,null,null,"","",""]
[null,null,null,"","",""]
[null,null,null,"","",""]
[null,null,null,"","",""]
[null,null,null,"","",""]
[null,null,null,"","",""]
[null,null,null,"","",""]
[null,null,null,"","",""]
[null,null,null,"","",""]
[null,null,null,"","",""]
[null,null,null,"","",""]
[null,null,null,"","",""]
[null,null,null,"","",""]
[null,null,null,"","",""]
[null,null,null,"","",""]
[null,null,null,"","",""]
[null,null,null,"","",""]
[null,null,null,"","",""]
[null,null,null,"","",""]
[null,null,null,"","",""]
[null,null,null,"","",""]
[null,null,null,"","",""]
[null,null,null,"","",""]
[null,null,null,"","",""]
[null,null,null,"","",""]
[null,null,null,"","",""]
[null,null,null,"","",""]
[null,null,null,"","",""]
[null,null,null,"","",""]
[null,null,null,"","",""]
[null,null,null,"","",""]
[null,null,null,"","",""]
[null,null,null,"","",""]
[null,null,null,"","",""]
[null,null,null,"","",""]
[null,null,null,"","",""]
[null,null,null,"","",""]
[null,null,null,"","",""]
[null,null,null,"","",""]
[null,null,null,"","",""]
[null,null,null,"","",""]
[null,null,null,"","",""]
[null,null,null,"","",""]
[null,null,null,"","",""]
[null,null,null,"","",""]
[null,null,null,"","",""]
[null,null,null,"","",""]
[null,null,null,"","",""]
[null,null,null,"","",""]
[null,null,null,"","",""]
[null,null,null,"","",""]
[null,null,null,"","",""]
[null,null,null,"","",""]
[null,null,null,"","",""]
[null,null,null,"","",""]
[null,null,null,"","",""]
[null,null,null,"","",""]
[null,null,null,"","",""]
[null,null,null,"","",""]
[null,null,null,"","",""]
[null,null,null,"","",""]
[null,null,null,"","",""]
[null,null,null,"","",""]
[null,null,null,"","",""]
[null,null,null,"","",""]
[null,null,null,"","",""]
[null,null,null,"","",""]
[null,null,null,"","",""]
[null,null,null,"","",""]
[null,null,null,"","",""]
[null,null,null,"","",""]
[null,null,null,"","",""]
[null,null,null,"","",""]
[null,null,null,"","",""]
[null,null,null,"","",""]
[null,null,null,"","",""]
[null,null,null,"","",""]
[null,null,null,"","",""]
[null,null,null,"","",""]
[null,null,null,"","",""]
[null,null,null,"","",""]
[null,null,null,"","",""]
[null,null,null,"","",""]
[null,null,null,"","",""]
[null,null,null,"","",""]
[null,null,null,"","",""]
[null,null,null,"","",""]
[null,null,null,"","",""]
[null,null,null,"","",""]
[null,null,null,"","",""]
[null,null,null,"","",""]
[null,null,null,"","",""]
[null,null,null,"","",""]
[null,null,null,"","",""]
[null,null,null,"","",""]
[null,null,null,"","",""]
[null,null,null,"","",""]
[null,null,null,"","",""]
[null,null,null,"","",""]
[null,null,null,"","",""]
[null,null,null,"","",""]
[null,null,null,"","",""]
[null,null,null,"","",""]
[null,null,null,"","",""]
[null,null,null,"","",""]
[null,null,null,"","",""]
[null,null,null,"","",""]
[null,null,null,"","",""]
[null,null,null,"","",""]
[null,null,null,"","",""]
[null,null,null,"","",""]
[null,null,null,"","",""]
[null,null,null,"","",""]
[null,null,null,"","",""]
[null,null,null,"","",""]
[null,null,null,"","",""]
[null,null,null,"","",""]
[null,null,null,"","",""]
[null,null,null,"","",""]
[null,null,null,"","",""]
[null,null,null,"","",""]
[null,null,null,"","",""]
[null,null,null,"","",""]
[null,null,null,"","",""]
[null,null,null,"","",""]
[null,null,null,"","",""]
[null,null,null,"","",""]
[null,null,null,"","",""]
[null,null,null,"","",""]
[null,null,null,"","",""]
[null,null,null,"","",""]
[null,null,null,"","",""]
[null,null,null,"","",""]
[null,null,null,"","",""]
[null,null,null,"","",""]
[null,null,null,"","",""]
[null,null,null,"","",""]
[null,null,null,"","",""]
[null,null,null,"","",""]
[null,null,null,"","",""]
[null,null,null,"","",""]
[null,null,null,"","",""]
[null,null,null,"","",""]
[null,null,null,"","",""]
[null,null,null,"","",""]
[null,null,null,"","",""]
[null,null,null,"","",""]
[null,null,null,"","",""]
[null,null,null,"","",""]
[null,null,null,"","",""]
[null,null,null,"","",""]
[null,null,null,"","",""]
[null,null,null,"","",""]
[null,null,null,"","",""]
[null,null,null,"","",""]
[null,null,null,"","",""]
[null,null,null,"","",""]
[null,null,null,"","",""]
[null,null,null,"","",""]
[null,null,null,"","",""]
[null,null,null,"","",""]
[null,null,null,"","",""]
[null,null,null,"","",""]
[null,null,null,"","",""]
[null,null,null,"","",""]
[null,null,null,"","",""]
[null,null,null,"","",""]
[null,null,null,"","",""]
[null,null,null,"","",""]
[null,null,null,"","",""]
[null,null,null,"","",""]
[null,null,null,"","",""]
[null,null,null,"","",""]
[null,null,null,"","",""]
[null,null,null,"","",""]
[null,null,null,"","",""]
[null,null,null,"","",""]
[null,null,null,"","",""]
[null,null,null,"","",""]
[null,null,null,"","",""]
[null,null,null,"","",""]
[null,null,null,"","",""]
[null,null,null,"","",""]
[null,null,null,"","",""]
[null,null,null,"","",""]
[null,null,null,"","",""]
[null,null,null,"","",""]
[null,null,null,"","",""]
[null,null,null,"","",""]
[null,null,null,"","",""]
[null,null,null,"","",""]
[null,null,null,"","",""]
[null,null,null,"","",""]
[null,null,null,"","",""]
[null,null,null,"","",""]
[null,null,null,"","",""]
[null,null,null,"","",""]
[null,null,null,"","",""]
[null,null,null,"","",""]
[null,null,null,"","",""]
[null,null,null,"","",""]
[null,null,null,"","",""]
[null,null,null,"","",""]
[null,null,null,"","",""]
[null,null,null,"","",""]
[null,null,null,"","",""]
[null,null,null,"","",""]
[null,null,null,"","",""]
[null,null,null,"","",""]
[null,null,null,"","",""]
[null,null,null,"","",""]
[null,null,null,"","",""]
[null,null,null,"","",""]
[null,null,null,"","",""]
[null,null,null,"","",""]
[null,null,null,"","",""]
[null,null,null,"","",""]
[null,null,null,"","",""]
[null,null,null,"","",""]
[null,null,null,"","",""]
[null,null,null,"","",""]
[null,null,null,"","",""]
[null,null,null,"","",""]
[null,null,null,"","",""]
[null,null,null,"","",""]
[null,null,null,"","",""]
{"$rows_empty":83}
[{"$nulls":4},"Area's size"]
[{"$nulls":4},500,null,"Week number start date","1/3/2011","1/10/2011","1/17/2011","1/24/2011","1/31/2011","2/7/2011","2/14/2011","2/21/2011","2/28/2011","3/7/2011","3/14/2011","3/21/2011","3/28/2011","4/4/2011","4/11/2011","4/18/2011","4/25/2011","5/2/2011","5/9/2011","5/16/2011","5/23/2011","5/30/2011","6/6/2011","6/13/2011","6/20/2011","6/27/2011","7/4/2011","7/11/2011","7/18/2011","7/25/2011","8/1/2011","8/8/2011","8/15/2011","8/22/2011","8/29/2011","9/5/2011","9/12/2011","9/19/2011","9/26/2011","10/3/2011","10/10/2011","10/17/2011","10/24/2011","10/31/2011","11/7/2011","11/14/2011","11/21/2011","11/28/2011","12/5/2011","12/12/2011","12/19/2011","12/26/2011","1/2/2012","1/9/2012","1/16/2012","1/23/2012","1/30/2012","2/6/2012","2/13/2012","2/20/2012","2/27/2012","3/5/2012","3/12/2012","3/19/2012","3/26/2012","4/2/2012","4/9/2012","4/16/2012","4/23/2012","4/30/2012","5/7/2012","5/14/2012","5/21/2012","5/28/2012","6/4/2012","6/11/2012","6/18/2012","6/25/2012","7/2/2012","7/9/2012","7/16/2012","7/23/2012","7/30/2012","8/6/2012","8/13/2012","8/20/2012","8/27/2012","9/3/2012","9/10/2012","9/17/2012","9/24/2012","10/1/2012","10/8/2012","10/15/2012","10/22/2012","10/29/2012","11/5/2012","11/12/2012","11/19/2012","11/26/2012","12/3/2012","12/10/2012","12/17/2012","12/24/2012","12/31/2012","1/7/2013","1/14/2013","1/21/2013","1/28/2013","2/4/2013","2/11/2013","2/18/2013","2/25/2013","3/4/2013","3/11/2013","3/18/2013","3/25/2013","4/1/2013","4/8/2013","4/15/2013","4/22/2013","4/29/2013","5/6/2013","5/13/2013","5/20/2013","5/27/2013","6/3/2013","6/10/2013","6/17/2013","6/24/2013","7/1/2013","7/8/2013","7/15/2013","7/22/2013","7/29/2013","8/5/2013","8/12/2013","8/19/2013","8/26/2013","9/2/2013","9/9/2013","9/16/2013","9/23/2013","9/30/2013","10/7/2013","10/14/2013","10/21/2013","10/28/2013","11/4/2013","11/11/2013","11/18/2013","11/25/2013","12/2/2013","12/9/2013","12/16/2013","12/23/2013","12/30/2013","1/6/2014","1/13/2014","1/20/2014","1/27/2014","2/3/2014","2/10/2014","2/17/2014","2/24/2014","3/3/2014","3/10/2014","3/17/2014","3/24/2014","3/31/2014","4/7/2014","4/14/2014","4/21/2014","4/28/2014","5/5/2014","5/12/2014","5/19/2014","5/26/2014","6/2/2014","6/9/2014","6/16/2014","6/23/2014","6/30/2014","7/7/2014","7/14/2014","7/21/2014","7/28/2014","8/4/2014","8/11/2014","8/18/2014","8/25/2014","9/1/2014","9/8/2014","9/15/2014","9/22/2014","9/29/2014","10/6/2014","10/13/2014","10/20/2014","10/27/2014","11/3/2014","11/10/2014","11/17/2014","11/24/2014","12/1/2014","12/8/2014","12/15/2014","12/22/2014","12/29/2014","1/5/2015","1/12/2015","1/19/2015","1/26/2015"]
[{"$nulls":6},"Week number  ","1/2011","2/2011","3/2011","4/2011","5/2011","6/2011","7/2011","8/2011","9/2011","10/2011","11/2011","12/2011","13/2011","14/2011","15/2011","16/2011","17/2011","18/2011","19/2011","20/2011","21/2011","22/2011","23/2011","24/2011","25/2011","26/2011","27/2011","28/2011","29/2011","30/2011","31/2011","32/2011","33/2011","34/2011","35/2011","36/2011","37/2011","38/2011","39/2011","40/2011","41/2011","42/2011","43/2011","44/2011","45/2011","46/2011","47/2011","48/2011","49/2011","50/2011","51/2011","52/2011","1/2012","2/2012","3/2012","4/2012","5/2012","6/2012","7/2012","8/2012","9/2012","10/2012","11/2012","12/2012","13/2012","14/2012","15/2012","16/2012","17/2012","18/2012","19/2012","20/2012","21/2012","22/2012","23/2012","24/2012","25/2012","26/2012","27/2012","28/2012","29/2012","30/2012","31/2012","32/2012","33/2012","34/2012","35/2012","36/2012","37/2012","38/2012","39/2012","40/2012","41/2012","42/2012","43/2012","44/2012","45/2012","46/2012","47/2012","48/2012","49/2012","50/2012","51/2012","52/2012","1/2013","2/2013","3/2013","4/2013","5/2013","6/2013","7/2013","8/2013","9/2013","10/2013","11/2013","12/2013","13/2013","14/2013","15/2013","16/2013","17/2013","18/2013","19/2013","20/2013","21/2013","22/2013","23/2013","24/2013","25/2013","26/2013","27/2013","28/2013","29/2013","30/2013","31/2013","32/2013","33/2013","34/2013","35/2013","36/2013","37/2013","38/2013","39/2013","40/2013","41/2013","42/2013","43/2013","44/2013","45/2013","46/2013","47/2013","48/2013","49/2013","50/2013","51/2013","52/2013","1/2014","2/2014","3/2014","4/2014","5/2014","6/2014","7/2014","8/2014","9/2014","10/2014","11/2014","12/2014","13/2014","14/2014","15/2014","16/2014","17/2014","18/2014","19/2014","20/2014","21/2014","22/2014","23/2014","24/2014","25/2014","26/2014","27/2014","28/2014","29/2014","30/2014","31/2014","32/2014","33/2014","34/2014","35/2014","36/2014","37/2014","38/2014","39/2014","40/2014","41/2014","42/2014","43/2014","44/2014","45/2014","46/2014","47/2014","48/2014","49/2014","50/2014","51/2014","52/2014","1/2015","2/2015","3/2015","4/2015","5/2015"]
[]
[{"$nulls":6},"Total space occupied",{"$f":"SUM(H20:H1019)","v":0},{"$f":"SUM(I20:I1019)","v":0},0,0,0,0,0,0,0,0,0,0,0,0,0,0,0,0,0,0,0,0,0,0,0,0,0,0,0,0,0,0,0,0,0,0,0,0,0,0,0,0,0,0,0,0,0,0,0,0,0,0,0,0,0,0,0,0,0,0,0,0,0,0,0,{"$f":"SUM(BU20:BU1019)","v":0},0,0,0,0,0,0,0,0,0,0,0,0,0,0,0,0,0,0,0,0,0,0,0,0,0,0,0,0,0,0,0,0,0,0,0,0,0,0,0,0,0,0,0,0,0,0,0,0,0,0,0,0,0,0,0,0,0,0,0,0,0,0,0,{"$f":"SUM(EG20:EG1019)","v":0},0,0,0,0,0,0,0,0,0,0,0,0,0,0,0,0,0,0,0,0,0,0,0,0,0,0,0,0,0,0,0,0,0,0,0,0,0,0,0,0,0,0,0,0,0,0,0,0,0,0,0,0,0,0,0,0,0,0,0,0,0,0,0,{"$f":"SUM(GS20:GS1019)","v":0},0,0,0,0,0,0,0,0,0,0,0,0,0,0,0,0,0,0,0]
[]
[{"$nulls":6},"Total space remaining",{"$f":"$E$1104-H1107","v":500},{"$f":"$E$1104-I1107","v":500},500,500,500,500,500,500,500,500,500,500,500,500,500,500,500,500,500,500,500,500,500,500,500,500,500,500,500,500,500,500,500,500,500,500,500,500,500,500,500,500,500,500,500,500,500,500,500,500,500,500,500,500,500,500,500,500,500,500,500,500,500,500,500,{"$f":"$E$1104-BU1107","v":500},500,500,500,500,500,500,500,500,500,500,500,500,500,500,500,500,500,500,500,500,500,500,500,500,500,500,500,500,500,500,500,500,500,500,500,500,500,500,500,500,500,500,500,500,500,500,500,500,500,500,500,500,500,500,500,500,500,500,500,500,500,500,500,{"$f":"$E$1104-EG1107","v":500},500,500,500,500,500,500,500,500,500,500,500,500,500,500,500,500,500,500,500,500,500,500,500,500,500,500,500,500,500,500,500,500,500,500,500,500,500,500,500,500,500,500,500,500,500,500,500,500,500,500,500,500,500,500,500,500,500,500,500,500,500,500,500,{"$f":"$E$1104-GS1107","v":500},500,500,500,500,500,500,500,500,500,500,500,500,500,500,500,500,500,500,500]

{"sheet":"Nursery summary report","index":10,"n_rows":404,"n_cols":232,"rows_kept":404,"cut":false,"hidden":false,"merged":[]}
[{"$nulls":231},"DROP DOWN MENU PAGES"]
[{"$nulls":6},"Nursery summary report           ",null,null,null,"Go to  "]
[]
[{"$nulls":231},"Production stage"]
[]
[{"$nulls":231},"Data entry form"]
[{"$nulls":6},"Week no. ",{"$nulls":224},"Search"]
[{"$nulls":6},"Week no. start date",{"$nulls":224},"Selection"]
[{"$nulls":6},"Total occupied space  ",{"$nulls":224},"Actions"]
[null,null,"Total floor space: ",null,"m2",null,"Total remaining space ",{"$nulls":224},"Actions summary"]
[{"$nulls":231},"Unique code summary"]
[null,null,"Site/environment type","Area name","Floor space","Max used","Remaining","Floor space remaining per nursery week ",{"$nulls":223},"Import data"]
[{"$nulls":231},"Imported selection"]
[{"$nulls":231},"Space output"]
[{"$nulls":231},"Nursery summary report"]
[{"$nulls":231},"Stage 1"]
[{"$nulls":231},"Final stage for sale"]
[{"$nulls":231},"Stage 2"]
[{"$nulls":231},"Stage 3"]
[{"$nulls":231},"Stage 4"]
[{"$nulls":231},"Stage 5"]
[{"$nulls":231},"Stage 6"]
[{"$nulls":231},"Stage 7"]
[{"$nulls":231},"Stage 8"]
[{"$nulls":231},"Stage 9"]
[null,null,"",{"$nulls":228},"Menu"]
[null,null,"",{"$nulls":228},"User guide"]
[null,null,"",{"$nulls":228},"Contact us"]
[null,null,"",{"$nulls":228},"Nursery details"]
[null,null,""]
[null,null,""]
[null,null,""]
[null,null,""]
[null,null,""]
[null,null,""]
[null,null,""]
[null,null,""]
[null,null,""]
[null,null,""]
[null,null,""]
[null,null,""]
[null,null,""]
[null,null,""]
[null,null,""]
[null,null,""]
[null,null,""]
[null,null,""]
[null,null,""]
[null,null,""]
[null,null,""]
[null,null,""]
[null,null,""]
[null,null,""]
[null,null,""]
[null,null,""]
[null,null,""]
[null,null,""]
[null,null,""]
[null,null,""]
[null,null,""]
[null,null,""]
[null,null,""]
[null,null,""]
[null,null,""]
[null,null,""]
[null,null,""]
[null,null,""]
[null,null,""]
[null,null,""]
[null,null,""]
[null,null,""]
[null,null,""]
[null,null,""]
[null,null,""]
[null,null,""]
[null,null,""]
[null,null,""]
[null,null,""]
[null,null,""]
[null,null,""]
[null,null,""]
[null,null,""]
[null,null,""]
[null,null,""]
[null,null,""]
[null,null,""]
[null,null,""]
[null,null,""]
[null,null,""]
[null,null,""]
[null,null,""]
[null,null,""]
[null,null,""]
[null,null,""]
[null,null,""]
[null,null,""]
[null,null,""]
[null,null,""]
[null,null,""]
[null,null,""]
[null,null,""]
[null,null,""]
[null,null,""]
[null,null,""]
[null,null,""]
[null,null,""]
[null,null,""]
[null,null,""]
[null,null,""]
[null,null,""]
[null,null,""]
[null,null,""]
[null,null,""]
[null,null,""]
[null,null,""]
[null,null,""]
[null,null,""]
[null,null,""]
[null,null,""]
[null,null,""]
[null,null,""]
[null,null,""]
[null,null,""]
[null,null,""]
[null,null,""]
[null,null,""]
[null,null,""]
[null,null,""]
[null,null,""]
[null,null,""]
[null,null,""]
{"$rows_empty":268}
[{"$nulls":7},{"$f":"$H$404-H401","v":0},{"$f":"$H$404-I401","v":0},0,0,0,0,0,0,0,0,0,0,0,0,0,0,0,0,0,0,0,0,0,0,0,0,0,0,0,0,0,0,0,0,0,0,0,0,0,0,0,0,0,0,0,0,0,0,0,0,0,0,0,0,0,0,0,0,0,0,0,0,0,0,0,{"$f":"$H$404-BU401","v":0},0,0,0,0,0,0,0,0,0,0,0,0,0,0,0,0,0,0,0,0,0,0,0,0,0,0,0,0,0,0,0,0,0,0,0,0,0,0,0,0,0,0,0,0,0,0,0,0,0,0,0,0,0,0,0,0,0,0,0,0,0,0,0,{"$f":"$H$404-EG401","v":0},0,0,0,0,0,0,0,0,0,0,0,0,0,0,0,0,0,0,0,0,0,0,0,0,0,0,0,0,0,0,0,0,0,0,0,0,0,0,0,0,0,0,0,0,0,0,0,0,0,0,0,0,0,0,0,0,0,0,0,0,0,0,0,{"$f":"$H$404-GS401","v":0},0,0,0,0,0,0,0,0,0,0,0,0,0,0,0,0,0,0,0]
[{"$nulls":7},{"$f":"SUM(H13:H131)","v":0},0,0,0,0,0,0,0,0,0,0,0,0,0,0,0,0,0,0,0,0,0,0,0,0,0,0,0,0,0,0,0,0,0,0,0,0,0,0,0,0,0,0,0,0,0,0,0,0,0,0,0,0,0,0,0,0,0,0,0,0,0,0,0,{"$f":"SUM(BT13:BT131)","v":0},0,0,0,0,0,0,0,0,0,0,0,0,0,0,0,0,0,0,0,0,0,0,0,0,0,0,0,0,0,0,0,0,0,0,0,0,0,0,0,0,0,0,0,0,0,0,0,0,0,0,0,0,0,0,0,0,0,0,0,0,0,0,0,{"$f":"SUM(EF13:EF131)","v":0},0,0,0,0,0,0,0,0,0,0,0,0,0,0,0,0,0,0,0,0,0,0,0,0,0,0,0,0,0,0,0,0,0,0,0,0,0,0,0,0,0,0,0,0,0,0,0,0,0,0,0,0,0,0,0,0,0,0,0,0,0,0,0,{"$f":"SUM(GR13:GR131)","v":0},0,0,0,0,0,0,0,0,0,0,0,0,0,0,0,0,0,0,0,0]
[]
[]
[{"$nulls":7},{"$f":"SUM(E13:E131)","v":0}]

{"sheet":"Stage 1","index":11,"n_rows":29,"n_cols":105,"rows_kept":29,"cut":false,"hidden":false,"merged":[]}
[null,"Stage 1",{"$nulls":25}," ",{"$nulls":76},"DROP DOWN MENU PAGES"]
[{"$nulls":8},"Go to"]
[]
["Column letter","Data type",null,null,"Column letter",null,"Data type",null,null,null,"Column letter",null,"Data type",{"$nulls":4},"Column letter",null,"Data type",null,null,null,"Column letter",null,"Data type",{"$nulls":4},"Column letter","Data type",{"$nulls":72},"Production stage"]
["A","Plant species and/or variety name",null,null,"P",null,"Entered stage-start date",null,null,null,"AE",null,"New area for Move action 2 within this stage ",{"$nulls":4},"AT",null,"Week number of action 4",null,null,null,"BI",null,"New crop density for action 5",{"$nulls":4},"BX","Memory Total area (m2)     "]
["B","The type of starting plant material",null,null,"Q",null,"Entered stage-end date",null,null,null,"AF",null,"New number of units for action 2",{"$nulls":4},"AU",null,"Production stage in which action was made",null,null,null,"BJ",null,"New space (area) occupied by batch after action 5",{"$nulls":4},"BY","Memory Site or environment type",{"$nulls":72},"Data entry form"]
["C","Starting date (dd/mm/yyyy)",null,null,"R",null,"Surplus or loss at Final stage for sale calculated from ProCost",null,null,null,"AG",null,"New batch spacing description for action 2",{"$nulls":4},"AV",null,"New site for Move action 4 within this stage ",null,null,null,"BK",null,"New ending week number if FSFS",{"$nulls":4},"BZ","Memory Area name or code (within site or environment type)",{"$nulls":72},"Search"]
["D","Starting week number",null,null,"S",null,"Week number of action 1",null,null,null,"AH",null,"New crop density for action 2",{"$nulls":4},"AW",null,"New area for Move action 4 within this stage ",null,null,null,"BL",null,"Memory Plant species and/or variety name",{"$nulls":4},"CA","Memory Entered stage-start date",{"$nulls":72},"Selection"]
["E","Estimated dispatch date (dd/mm/yyyy)",null,null,"T",null,"Production stage in which action was made",null,null,null,"AI",null,"New space (area) occupied by batch after action 2",{"$nulls":4},"AX",null,"New number of units for action 4",null,null,null,"BM",null,"Memory The type of starting plant material",{"$nulls":4},"CB","Memory Entered stage-end date",{"$nulls":72},"Actions"]
["F","Estimated dispatch week number",null,null,"U",null,"New site for Move action 1 within this stage ",null,null,null,"AJ",null,"New ending week number if FSFS",{"$nulls":4},"AY",null,"New batch spacing description for action 4",null,null,null,"BN",null,"Memory Starting date (dd/mm/yyyy)",{"$nulls":4},"CC","Memory Surplus or loss at Final stage for sale calculated from ProCost",{"$nulls":72},"Actions summary"]
["G","Unique code for this batch of plants",null,null,"V",null,"New area for Move action 1 within this stage ",null,null,null,"AK",null,"Week number of action 3",{"$nulls":4},"AZ",null,"New crop density for action 4",null,null,null,"BO",null,"Memory Starting week number",{"$nulls":78},"Unique code summary"]
["H","Sales or order number",null,null,"W",null,"New number of units for action 1",null,null,null,"AL",null,"Production stage in which action was made",{"$nulls":4},"BA",null,"New space (area) occupied by batch after action 4",null,null,null,"BP",null,"Memory Estimated dispatch date (dd/mm/yyyy)",{"$nulls":78},"Import data"]
["I","Unit number (plant number) for this batch",null,null,"X",null,"New batch spacing description for action 1",null,null,null,"AM",null,"New site for Move action 3 within this stage ",{"$nulls":4},"BB",null,"New ending week number if FSFS",null,null,null,"BQ",null,"Memory Estimated dispatch week number",{"$nulls":78},"Imported selection"]
["J","Container type",null,null,"Y",null,"New crop density for action 1",null,null,null,"AN",null,"New area for Move action 3 within this stage ",{"$nulls":4},"BC",null,"Week number of action 5",null,null,null,"BR",null,"Memory Unique code for this batch of plants",{"$nulls":78},"Space output"]
["K","Spacing description",null,null,"Z",null,"New space (area) occupied by batch after action 1",null,null,null,"AO",null,"New number of units for action 3",{"$nulls":4},"BD",null,"Production stage in which action was made",null,null,null,"BS",null,"Memory Sales or order number",{"$nulls":78},"Nursery summary report"]
["L","Crop density (plants per m2)",null,null,"AA",null,"New ending week number if FSFS",null,null,null,"AP",null,"New batch spacing description for action 3",{"$nulls":4},"BE",null,"New site for Move action 5 within this stage ",null,null,null,"BT",null,"Memory Unit number (plant number) for this batch",{"$nulls":78},"Stage 1"]
["M","Total area (m2)     ",null,null,"AB",null,"Week number of action 2",null,null,null,"AQ",null,"New crop density for action 3",{"$nulls":4},"BF",null,"New area for Move action 5 within this stage ",null,null,null,"BU",null,"Memory Container type",{"$nulls":78},"Final stage for sale"]
["N","Site or environment type",null,null,"AC",null,"Production stage in which action was made",null,null,null,"AR",null,"New space (area) occupied by batch after action 3",{"$nulls":4},"BG",null,"New number of units for action 5",null,null,null,"BV",null,"Memory Spacing description",{"$nulls":78},"Stage 2"]
["O","Area name or code (within site or environment type)",null,null,"AD",null,"New site for Move action 2 within this stage ",null,null,null,"AS",null,"New ending week number if FSFS",{"$nulls":4},"BH",null,"New batch spacing description for action 5",null,null,null,"BW",null,"Crop Memorydensity (plants per m2)",{"$nulls":78},"Stage 3"]
[{"$nulls":104},"Stage 4"]
[{"$nulls":18},19,20,21,22,23,24,25,26,27,28,29,30,31,32,33,34,35,36,37,38,39,40,41,42,43,44,45,46,47,48,49,50,51,52,53,54,55,56,57,58,59,60,61,62,63,64,65,66,67,68,69,70,71,72,73,74,75,76,77,78,79,80,81,{"$nulls":23},"Stage 5"]
[{"$nulls":104},"Stage 6"]
[{"$nulls":104},"Stage 7"]
[{"$nulls":104},"Stage 8"]
[{"$nulls":104},"Stage 9"]
[{"$nulls":104},"Menu"]
[{"$nulls":104},"User guide"]
[{"$nulls":104},"Contact us"]
[{"$nulls":104},"Nursery details"]

{"sheet":"Stage 2","index":12,"n_rows":29,"n_cols":105,"rows_kept":29,"cut":false,"hidden":false,"merged":[]}
[null,"Stage 2",{"$nulls":25}," ",{"$nulls":76},"DROP DOWN MENU PAGES"]
[{"$nulls":8},"Go to"]
[]
["Column letter","Data type",null,null,"Column letter",null,"Data type",null,null,null,"Column letter",null,"Data type",{"$nulls":4},"Column letter",null,"Data type",null,null,null,"Column letter",null,"Data type",{"$nulls":4},"Column letter","Data type",{"$nulls":72},"Production stage"]
["A","Plant species and/or variety name",null,null,"P",null,"Entered stage-start date",null,null,null,"AE",null,"New area for Move action 2 within this stage ",{"$nulls":4},"AT",null,"Week number of action 4",null,null,null,"BI",null,"New crop density for action 5",{"$nulls":4},"BX","Memory Total area (m2)     "]
["B","The type of starting plant material",null,null,"Q",null,"Entered stage-end date",null,null,null,"AF",null,"New number of units for action 2",{"$nulls":4},"AU",null,"Production stage in which action was made",null,null,null,"BJ",null,"New space (area) occupied by batch after action 5",{"$nulls":4},"BY","Memory Site or environment type",{"$nulls":72},"Data entry form"]
["C","Starting date (dd/mm/yyyy)",null,null,"R",null,"Surplus or loss at Final stage for sale calculated from ProCost",null,null,null,"AG",null,"New batch spacing description for action 2",{"$nulls":4},"AV",null,"New site for Move action 4 within this stage ",null,null,null,"BK",null,"New ending week number if FSFS",{"$nulls":4},"BZ","Memory Area name or code (within site or environment type)",{"$nulls":72},"Search"]
["D","Starting week number",null,null,"S",null,"Week number of action 1",null,null,null,"AH",null,"New crop density for action 2",{"$nulls":4},"AW",null,"New area for Move action 4 within this stage ",null,null,null,"BL",null,"Memory Plant species and/or variety name",{"$nulls":4},"CA","Memory Entered stage-start date",{"$nulls":72},"Selection"]
["E","Estimated dispatch date (dd/mm/yyyy)",null,null,"T",null,"Production stage in which action was made",null,null,null,"AI",null,"New space (area) occupied by batch after action 2",{"$nulls":4},"AX",null,"New number of units for action 4",null,null,null,"BM",null,"Memory The type of starting plant material",{"$nulls":4},"CB","Memory Entered stage-end date",{"$nulls":72},"Actions"]
["F","Estimated dispatch week number",null,null,"U",null,"New site for Move action 1 within this stage ",null,null,null,"AJ",null,"New ending week number if FSFS",{"$nulls":4},"AY",null,"New batch spacing description for action 4",null,null,null,"BN",null,"Memory Starting date (dd/mm/yyyy)",{"$nulls":4},"CC","Memory Surplus or loss at Final stage for sale calculated from ProCost",{"$nulls":72},"Actions summary"]
["G","Unique code for this batch of plants",null,null,"V",null,"New area for Move action 1 within this stage ",null,null,null,"AK",null,"Week number of action 3",{"$nulls":4},"AZ",null,"New crop density for action 4",null,null,null,"BO",null,"Memory Starting week number",{"$nulls":78},"Unique code summary"]
["H","Sales or order number",null,null,"W",null,"New number of units for action 1",null,null,null,"AL",null,"Production stage in which action was made",{"$nulls":4},"BA",null,"New space (area) occupied by batch after action 4",null,null,null,"BP",null,"Memory Estimated dispatch date (dd/mm/yyyy)",{"$nulls":78},"Import data"]
["I","Unit number (plant number) for this batch",null,null,"X",null,"New batch spacing description for action 1",null,null,null,"AM",null,"New site for Move action 3 within this stage ",{"$nulls":4},"BB",null,"New ending week number if FSFS",null,null,null,"BQ",null,"Memory Estimated dispatch week number",{"$nulls":78},"Imported selection"]
["J","Container type",null,null,"Y",null,"New crop density for action 1",null,null,null,"AN",null,"New area for Move action 3 within this stage ",{"$nulls":4},"BC",null,"Week number of action 5",null,null,null,"BR",null,"Memory Unique code for this batch of plants",{"$nulls":78},"Space output"]
["K","Spacing description",null,null,"Z",null,"New space (area) occupied by batch after action 1",null,null,null,"AO",null,"New number of units for action 3",{"$nulls":4},"BD",null,"Production stage in which action was made",null,null,null,"BS",null,"Memory Sales or order number",{"$nulls":78},"Nursery summary report"]
["L","Crop density (plants per m2)",null,null,"AA",null,"New ending week number if FSFS",null,null,null,"AP",null,"New batch spacing description for action 3",{"$nulls":4},"BE",null,"New site for Move action 5 within this stage ",null,null,null,"BT",null,"Memory Unit number (plant number) for this batch",{"$nulls":78},"Stage 1"]
["M","Total area (m2)     ",null,null,"AB",null,"Week number of action 2",null,null,null,"AQ",null,"New crop density for action 3",{"$nulls":4},"BF",null,"New area for Move action 5 within this stage ",null,null,null,"BU",null,"Memory Container type",{"$nulls":78},"Final stage for sale"]
["N","Site or environment type",null,null,"AC",null,"Production stage in which action was made",null,null,null,"AR",null,"New space (area) occupied by batch after action 3",{"$nulls":4},"BG",null,"New number of units for action 5",null,null,null,"BV",null,"Memory Spacing description",{"$nulls":78},"Stage 2"]
["O","Area name or code (within site or environment type)",null,null,"AD",null,"New site for Move action 2 within this stage ",null,null,null,"AS",null,"New ending week number if FSFS",{"$nulls":4},"BH",null,"New batch spacing description for action 5",null,null,null,"BW",null,"Crop Memorydensity (plants per m2)",{"$nulls":78},"Stage 3"]
[{"$nulls":104},"Stage 4"]
[{"$nulls":18},19,20,21,22,23,24,25,26,27,28,29,30,31,32,33,34,35,36,37,38,39,40,41,42,43,44,45,46,47,48,49,50,51,52,53,54,55,56,57,58,59,60,61,62,63,64,65,66,67,68,69,70,71,72,73,74,75,76,77,78,79,80,81,{"$nulls":23},"Stage 5"]
[{"$nulls":104},"Stage 6"]
[{"$nulls":18},"",{"$nulls":85},"Stage 7"]
[{"$nulls":104},"Stage 8"]
[{"$nulls":104},"Stage 9"]
[{"$nulls":18},"",{"$nulls":6},"",{"$nulls":78},"Menu"]
[{"$nulls":18},"",{"$nulls":6},"",{"$nulls":78},"User guide"]
[{"$nulls":104},"Contact us"]
[{"$nulls":104},"Nursery details"]

{"sheet":"Stage 3","index":13,"n_rows":29,"n_cols":105,"rows_kept":29,"cut":false,"hidden":false,"merged":[]}
[null,"Stage 3",{"$nulls":25}," ",{"$nulls":76},"DROP DOWN MENU PAGES"]
[{"$nulls":8},"Go to"]
[]
["Column letter","Data type",null,null,"Column letter",null,"Data type",null,null,null,"Column letter",null,"Data type",{"$nulls":4},"Column letter",null,"Data type",null,null,null,"Column letter",null,"Data type",{"$nulls":4},"Column letter","Data type",{"$nulls":72},"Production stage"]
["A","Plant species and/or variety name",null,null,"P",null,"Entered stage-start date",null,null,null,"AE",null,"New area for Move action 2 within this stage ",{"$nulls":4},"AT",null,"Week number of action 4",null,null,null,"BI",null,"New crop density for action 5",{"$nulls":4},"BX","Memory Total area (m2)     "]
["B","The type of starting plant material",null,null,"Q",null,"Entered stage-end date",null,null,null,"AF",null,"New number of units for action 2",{"$nulls":4},"AU",null,"Production stage in which action was made",null,null,null,"BJ",null,"New space (area) occupied by batch after action 5",{"$nulls":4},"BY","Memory Site or environment type",{"$nulls":72},"Data entry form"]
["C","Starting date (dd/mm/yyyy)",null,null,"R",null,"Surplus or loss at Final stage for sale calculated from ProCost",null,null,null,"AG",null,"New batch spacing description for action 2",{"$nulls":4},"AV",null,"New site for Move action 4 within this stage ",null,null,null,"BK",null,"New ending week number if FSFS",{"$nulls":4},"BZ","Memory Area name or code (within site or environment type)",{"$nulls":72},"Search"]
["D","Starting week number",null,null,"S",null,"Week number of action 1",null,null,null,"AH",null,"New crop density for action 2",{"$nulls":4},"AW",null,"New area for Move action 4 within this stage ",null,null,null,"BL",null,"Memory Plant species and/or variety name",{"$nulls":4},"CA","Memory Entered stage-start date",{"$nulls":72},"Selection"]
["E","Estimated dispatch date (dd/mm/yyyy)",null,null,"T",null,"Production stage in which action was made",null,null,null,"AI",null,"New space (area) occupied by batch after action 2",{"$nulls":4},"AX",null,"New number of units for action 4",null,null,null,"BM",null,"Memory The type of starting plant material",{"$nulls":4},"CB","Memory Entered stage-end date",{"$nulls":72},"Actions"]
["F","Estimated dispatch week number",null,null,"U",null,"New site for Move action 1 within this stage ",null,null,null,"AJ",null,"New ending week number if FSFS",{"$nulls":4},"AY",null,"New batch spacing description for action 4",null,null,null,"BN",null,"Memory Starting date (dd/mm/yyyy)",{"$nulls":4},"CC","Memory Surplus or loss at Final stage for sale calculated from ProCost",{"$nulls":72},"Actions summary"]
["G","Unique code for this batch of plants",null,null,"V",null,"New area for Move action 1 within this stage ",null,null,null,"AK",null,"Week number of action 3",{"$nulls":4},"AZ",null,"New crop density for action 4",null,null,null,"BO",null,"Memory Starting week number",{"$nulls":78},"Unique code summary"]
["H","Sales or order number",null,null,"W",null,"New number of units for action 1",null,null,null,"AL",null,"Production stage in which action was made",{"$nulls":4},"BA",null,"New space (area) occupied by batch after action 4",null,null,null,"BP",null,"Memory Estimated dispatch date (dd/mm/yyyy)",{"$nulls":78},"Import data"]
["I","Unit number (plant number) for this batch",null,null,"X",null,"New batch spacing description for action 1",null,null,null,"AM",null,"New site for Move action 3 within this stage ",{"$nulls":4},"BB",null,"New ending week number if FSFS",null,null,null,"BQ",null,"Memory Estimated dispatch week number",{"$nulls":78},"Imported selection"]
["J","Container type",null,null,"Y",null,"New crop density for action 1",null,null,null,"AN",null,"New area for Move action 3 within this stage ",{"$nulls":4},"BC",null,"Week number of action 5",null,null,null,"BR",null,"Memory Unique code for this batch of plants",{"$nulls":78},"Space output"]
["K","Spacing description",null,null,"Z",null,"New space (area) occupied by batch after action 1",null,null,null,"AO",null,"New number of units for action 3",{"$nulls":4},"BD",null,"Production stage in which action was made",null,null,null,"BS",null,"Memory Sales or order number",{"$nulls":78},"Nursery summary report"]
["L","Crop density (plants per m2)",null,null,"AA",null,"New ending week number if FSFS",null,null,null,"AP",null,"New batch spacing description for action 3",{"$nulls":4},"BE",null,"New site for Move action 5 within this stage ",null,null,null,"BT",null,"Memory Unit number (plant number) for this batch",{"$nulls":78},"Stage 1"]
["M","Total area (m2)     ",null,null,"AB",null,"Week number of action 2",null,null,null,"AQ",null,"New crop density for action 3",{"$nulls":4},"BF",null,"New area for Move action 5 within this stage ",null,null,null,"BU",null,"Memory Container type",{"$nulls":78},"Final stage for sale"]
["N","Site or environment type",null,null,"AC",null,"Production stage in which action was made",null,null,null,"AR",null,"New space (area) occupied by batch after action 3",{"$nulls":4},"BG",null,"New number of units for action 5",null,null,null,"BV",null,"Memory Spacing description",{"$nulls":78},"Stage 2"]
["O","Area name or code (within site or environment type)",null,null,"AD",null,"New site for Move action 2 within this stage ",null,null,null,"AS",null,"New ending week number if FSFS",{"$nulls":4},"BH",null,"New batch spacing description for action 5",null,null,null,"BW",null,"Crop Memorydensity (plants per m2)",{"$nulls":78},"Stage 3"]
[{"$nulls":104},"Stage 4"]
[{"$nulls":18},19,20,21,22,23,24,25,26,27,28,29,30,31,32,33,34,35,36,37,38,39,40,41,42,43,44,45,46,47,48,49,50,51,52,53,54,55,56,57,58,59,60,61,62,63,64,65,66,67,68,69,70,71,72,73,74,75,76,77,78,79,80,81,{"$nulls":23},"Stage 5"]
[{"$nulls":18},"",{"$nulls":6},"",null,"",{"$nulls":6},"",null,"",{"$nulls":6},"",null,"",{"$nulls":6},"",null,"",{"$nulls":6},"",{"$nulls":42},"Stage 6"]
[{"$nulls":18},"",{"$nulls":6},"",{"$nulls":78},"Stage 7"]
[{"$nulls":104},"Stage 8"]
[{"$nulls":104},"Stage 9"]
[{"$nulls":18},"",{"$nulls":6},"",{"$nulls":78},"Menu"]
[{"$nulls":18},"",{"$nulls":6},"",{"$nulls":78},"User guide"]
[{"$nulls":104},"Contact us"]
[{"$nulls":104},"Nursery details"]

{"sheet":"Stage 4","index":14,"n_rows":29,"n_cols":105,"rows_kept":29,"cut":false,"hidden":false,"merged":[]}
[null,"Stage 4",{"$nulls":25}," ",{"$nulls":76},"DROP DOWN MENU PAGES"]
[{"$nulls":8},"Go to"]
[]
["Column letter","Data type",null,null,"Column letter",null,"Data type",null,null,null,"Column letter",null,"Data type",{"$nulls":4},"Column letter",null,"Data type",null,null,null,"Column letter",null,"Data type",{"$nulls":4},"Column letter","Data type",{"$nulls":72},"Production stage"]
["A","Plant species and/or variety name",null,null,"P",null,"Entered stage-start date",null,null,null,"AE",null,"New area for Move action 2 within this stage ",{"$nulls":4},"AT",null,"Week number of action 4",null,null,null,"BI",null,"New crop density for action 5",{"$nulls":4},"BX","Memory Total area (m2)     "]
["B","The type of starting plant material",null,null,"Q",null,"Entered stage-end date",null,null,null,"AF",null,"New number of units for action 2",{"$nulls":4},"AU",null,"Production stage in which action was made",null,null,null,"BJ",null,"New space (area) occupied by batch after action 5",{"$nulls":4},"BY","Memory Site or environment type",{"$nulls":72},"Data entry form"]
["C","Starting date (dd/mm/yyyy)",null,null,"R",null,"Surplus or loss at Final stage for sale calculated from ProCost",null,null,null,"AG",null,"New batch spacing description for action 2",{"$nulls":4},"AV",null,"New site for Move action 4 within this stage ",null,null,null,"BK",null,"New ending week number if FSFS",{"$nulls":4},"BZ","Memory Area name or code (within site or environment type)",{"$nulls":72},"Search"]
["D","Starting week number",null,null,"S",null,"Week number of action 1",null,null,null,"AH",null,"New crop density for action 2",{"$nulls":4},"AW",null,"New area for Move action 4 within this stage ",null,null,null,"BL",null,"Memory Plant species and/or variety name",{"$nulls":4},"CA","Memory Entered stage-start date",{"$nulls":72},"Selection"]
["E","Estimated dispatch date (dd/mm/yyyy)",null,null,"T",null,"Production stage in which action was made",null,null,null,"AI",null,"New space (area) occupied by batch after action 2",{"$nulls":4},"AX",null,"New number of units for action 4",null,null,null,"BM",null,"Memory The type of starting plant material",{"$nulls":4},"CB","Memory Entered stage-end date",{"$nulls":72},"Actions"]
["F","Estimated dispatch week number",null,null,"U",null,"New site for Move action 1 within this stage ",null,null,null,"AJ",null,"New ending week number if FSFS",{"$nulls":4},"AY",null,"New batch spacing description for action 4",null,null,null,"BN",null,"Memory Starting date (dd/mm/yyyy)",{"$nulls":4},"CC","Memory Surplus or loss at Final stage for sale calculated from ProCost",{"$nulls":72},"Actions summary"]
["G","Unique code for this batch of plants",null,null,"V",null,"New area for Move action 1 within this stage ",null,null,null,"AK",null,"Week number of action 3",{"$nulls":4},"AZ",null,"New crop density for action 4",null,null,null,"BO",null,"Memory Starting week number",{"$nulls":78},"Unique code summary"]
["H","Sales or order number",null,null,"W",null,"New number of units for action 1",null,null,null,"AL",null,"Production stage in which action was made",{"$nulls":4},"BA",null,"New space (area) occupied by batch after action 4",null,null,null,"BP",null,"Memory Estimated dispatch date (dd/mm/yyyy)",{"$nulls":78},"Import data"]
["I","Unit number (plant number) for this batch",null,null,"X",null,"New batch spacing description for action 1",null,null,null,"AM",null,"New site for Move action 3 within this stage ",{"$nulls":4},"BB",null,"New ending week number if FSFS",null,null,null,"BQ",null,"Memory Estimated dispatch week number",{"$nulls":78},"Imported selection"]
["J","Container type",null,null,"Y",null,"New crop density for action 1",null,null,null,"AN",null,"New area for Move action 3 within this stage ",{"$nulls":4},"BC",null,"Week number of action 5",null,null,null,"BR",null,"Memory Unique code for this batch of plants",{"$nulls":78},"Space output"]
["K","Spacing description",null,null,"Z",null,"New space (area) occupied by batch after action 1",null,null,null,"AO",null,"New number of units for action 3",{"$nulls":4},"BD",null,"Production stage in which action was made",null,null,null,"BS",null,"Memory Sales or order number",{"$nulls":78},"Nursery summary report"]
["L","Crop density (plants per m2)",null,null,"AA",null,"New ending week number if FSFS",null,null,null,"AP",null,"New batch spacing description for action 3",{"$nulls":4},"BE",null,"New site for Move action 5 within this stage ",null,null,null,"BT",null,"Memory Unit number (plant number) for this batch",{"$nulls":78},"Stage 1"]
["M","Total area (m2)     ",null,null,"AB",null,"Week number of action 2",null,null,null,"AQ",null,"New crop density for action 3",{"$nulls":4},"BF",null,"New area for Move action 5 within this stage ",null,null,null,"BU",null,"Memory Container type",{"$nulls":78},"Final stage for sale"]
["N","Site or environment type",null,null,"AC",null,"Production stage in which action was made",null,null,null,"AR",null,"New space (area) occupied by batch after action 3",{"$nulls":4},"BG",null,"New number of units for action 5",null,null,null,"BV",null,"Memory Spacing description",{"$nulls":78},"Stage 2"]
["O","Area name or code (within site or environment type)",null,null,"AD",null,"New site for Move action 2 within this stage ",null,null,null,"AS",null,"New ending week number if FSFS",{"$nulls":4},"BH",null,"New batch spacing description for action 5",null,null,null,"BW",null,"Crop Memorydensity (plants per m2)",{"$nulls":78},"Stage 3"]
[{"$nulls":104},"Stage 4"]
[{"$nulls":18},19,20,21,22,23,24,25,26,27,28,29,30,31,32,33,34,35,36,37,38,39,40,41,42,43,44,45,46,47,48,49,50,51,52,53,54,55,56,57,58,59,60,61,62,63,64,65,66,67,68,69,70,71,72,73,74,75,76,77,78,79,80,81,{"$nulls":23},"Stage 5"]
[{"$nulls":18},"",{"$nulls":6},"",null,"",{"$nulls":6},"",null,"",{"$nulls":6},"",null,"",{"$nulls":6},"",null,"",{"$nulls":6},"",{"$nulls":42},"Stage 6"]
[{"$nulls":18},"",{"$nulls":6},"",{"$nulls":78},"Stage 7"]
[{"$nulls":104},"Stage 8"]
[{"$nulls":104},"Stage 9"]
[{"$nulls":18},"",{"$nulls":6},"",{"$nulls":78},"Menu"]
[{"$nulls":18},"",{"$nulls":6},"",{"$nulls":78},"User guide"]
[{"$nulls":104},"Contact us"]
[{"$nulls":104},"Nursery details"]

{"sheet":"Stage 5","index":15,"n_rows":29,"n_cols":105,"rows_kept":29,"cut":false,"hidden":false,"merged":[]}
[null,"Stage 5",{"$nulls":25}," ",{"$nulls":76},"DROP DOWN MENU PAGES"]
[{"$nulls":8},"Go to"]
[]
["Column letter","Data type",null,null,"Column letter",null,"Data type",null,null,null,"Column letter",null,"Data type",{"$nulls":4},"Column letter",null,"Data type",null,null,null,"Column letter",null,"Data type",{"$nulls":4},"Column letter","Data type",{"$nulls":72},"Production stage"]
["A","Plant species and/or variety name",null,null,"P",null,"Entered stage-start date",null,null,null,"AE",null,"New area for Move action 2 within this stage ",{"$nulls":4},"AT",null,"Week number of action 4",null,null,null,"BI",null,"New crop density for action 5",{"$nulls":4},"BX","Memory Total area (m2)     "]
["B","The type of starting plant material",null,null,"Q",null,"Entered stage-end date",null,null,null,"AF",null,"New number of units for action 2",{"$nulls":4},"AU",null,"Production stage in which action was made",null,null,null,"BJ",null,"New space (area) occupied by batch after action 5",{"$nulls":4},"BY","Memory Site or environment type",{"$nulls":72},"Data entry form"]
["C","Starting date (dd/mm/yyyy)",null,null,"R",null,"Surplus or loss at Final stage for sale calculated from ProCost",null,null,null,"AG",null,"New batch spacing description for action 2",{"$nulls":4},"AV",null,"New site for Move action 4 within this stage ",null,null,null,"BK",null,"New ending week number if FSFS",{"$nulls":4},"BZ","Memory Area name or code (within site or environment type)",{"$nulls":72},"Search"]
["D","Starting week number",null,null,"S",null,"Week number of action 1",null,null,null,"AH",null,"New crop density for action 2",{"$nulls":4},"AW",null,"New area for Move action 4 within this stage ",null,null,null,"BL",null,"Memory Plant species and/or variety name",{"$nulls":4},"CA","Memory Entered stage-start date",{"$nulls":72},"Selection"]
["E","Estimated dispatch date (dd/mm/yyyy)",null,null,"T",null,"Production stage in which action was made",null,null,null,"AI",null,"New space (area) occupied by batch after action 2",{"$nulls":4},"AX",null,"New number of units for action 4",null,null,null,"BM",null,"Memory The type of starting plant material",{"$nulls":4},"CB","Memory Entered stage-end date",{"$nulls":72},"Actions"]
["F","Estimated dispatch week number",null,null,"U",null,"New site for Move action 1 within this stage ",null,null,null,"AJ",null,"New ending week number if FSFS",{"$nulls":4},"AY",null,"New batch spacing description for action 4",null,null,null,"BN",null,"Memory Starting date (dd/mm/yyyy)",{"$nulls":4},"CC","Memory Surplus or loss at Final stage for sale calculated from ProCost",{"$nulls":72},"Actions summary"]
["G","Unique code for this batch of plants",null,null,"V",null,"New area for Move action 1 within this stage ",null,null,null,"AK",null,"Week number of action 3",{"$nulls":4},"AZ",null,"New crop density for action 4",null,null,null,"BO",null,"Memory Starting week number",{"$nulls":78},"Unique code summary"]
["H","Sales or order number",null,null,"W",null,"New number of units for action 1",null,null,null,"AL",null,"Production stage in which action was made",{"$nulls":4},"BA",null,"New space (area) occupied by batch after action 4",null,null,null,"BP",null,"Memory Estimated dispatch date (dd/mm/yyyy)",{"$nulls":78},"Import data"]
["I","Unit number (plant number) for this batch",null,null,"X",null,"New batch spacing description for action 1",null,null,null,"AM",null,"New site for Move action 3 within this stage ",{"$nulls":4},"BB",null,"New ending week number if FSFS",null,null,null,"BQ",null,"Memory Estimated dispatch week number",{"$nulls":78},"Imported selection"]
["J","Container type",null,null,"Y",null,"New crop density for action 1",null,null,null,"AN",null,"New area for Move action 3 within this stage ",{"$nulls":4},"BC",null,"Week number of action 5",null,null,null,"BR",null,"Memory Unique code for this batch of plants",{"$nulls":78},"Space output"]
["K","Spacing description",null,null,"Z",null,"New space (area) occupied by batch after action 1",null,null,null,"AO",null,"New number of units for action 3",{"$nulls":4},"BD",null,"Production stage in which action was made",null,null,null,"BS",null,"Memory Sales or order number",{"$nulls":78},"Nursery summary report"]
["L","Crop density (plants per m2)",null,null,"AA",null,"New ending week number if FSFS",null,null,null,"AP",null,"New batch spacing description for action 3",{"$nulls":4},"BE",null,"New site for Move action 5 within this stage ",null,null,null,"BT",null,"Memory Unit number (plant number) for this batch",{"$nulls":78},"Stage 1"]
["M","Total area (m2)     ",null,null,"AB",null,"Week number of action 2",null,null,null,"AQ",null,"New crop density for action 3",{"$nulls":4},"BF",null,"New area for Move action 5 within this stage ",null,null,null,"BU",null,"Memory Container type",{"$nulls":78},"Final stage for sale"]
["N","Site or environment type",null,null,"AC",null,"Production stage in which action was made",null,null,null,"AR",null,"New space (area) occupied by batch after action 3",{"$nulls":4},"BG",null,"New number of units for action 5",null,null,null,"BV",null,"Memory Spacing description",{"$nulls":78},"Stage 2"]
["O","Area name or code (within site or environment type)",null,null,"AD",null,"New site for Move action 2 within this stage ",null,null,null,"AS",null,"New ending week number if FSFS",{"$nulls":4},"BH",null,"New batch spacing description for action 5",null,null,null,"BW",null,"Crop Memorydensity (plants per m2)",{"$nulls":78},"Stage 3"]
[{"$nulls":104},"Stage 4"]
[{"$nulls":18},19,20,21,22,23,24,25,26,27,28,29,30,31,32,33,34,35,36,37,38,39,40,41,42,43,44,45,46,47,48,49,50,51,52,53,54,55,56,57,58,59,60,61,62,63,64,65,66,67,68,69,70,71,72,73,74,75,76,77,78,79,80,81,{"$nulls":23},"Stage 5"]
[{"$nulls":18},"",{"$nulls":6},"",null,"",{"$nulls":6},"",null,"",{"$nulls":6},"",null,"",{"$nulls":6},"",null,"",{"$nulls":6},"",{"$nulls":42},"Stage 6"]
[{"$nulls":18},"",{"$nulls":6},"",{"$nulls":78},"Stage 7"]
[{"$nulls":104},"Stage 8"]
[{"$nulls":104},"Stage 9"]
[{"$nulls":18},"",{"$nulls":6},"",{"$nulls":78},"Menu"]
[{"$nulls":18},"",{"$nulls":6},"",{"$nulls":78},"User guide"]
[{"$nulls":104},"Contact us"]
[{"$nulls":104},"Nursery details"]

{"sheet":"Stage 6","index":16,"n_rows":29,"n_cols":105,"rows_kept":29,"cut":false,"hidden":false,"merged":[]}
[null,"Stage 6",{"$nulls":25}," ",{"$nulls":76},"DROP DOWN MENU PAGES"]
[{"$nulls":8},"Go to"]
[]
["Column letter","Data type",null,null,"Column letter",null,"Data type",null,null,null,"Column letter",null,"Data type",{"$nulls":4},"Column letter",null,"Data type",null,null,null,"Column letter",null,"Data type",{"$nulls":4},"Column letter","Data type",{"$nulls":72},"Production stage"]
["A","Plant species and/or variety name",null,null,"P",null,"Entered stage-start date",null,null,null,"AE",null,"New area for Move action 2 within this stage ",{"$nulls":4},"AT",null,"Week number of action 4",null,null,null,"BI",null,"New crop density for action 5",{"$nulls":4},"BX","Memory Total area (m2)     "]
["B","The type of starting plant material",null,null,"Q",null,"Entered stage-end date",null,null,null,"AF",null,"New number of units for action 2",{"$nulls":4},"AU",null,"Production stage in which action was made",null,null,null,"BJ",null,"New space (area) occupied by batch after action 5",{"$nulls":4},"BY","Memory Site or environment type",{"$nulls":72},"Data entry form"]
["C","Starting date (dd/mm/yyyy)",null,null,"R",null,"Surplus or loss at Final stage for sale calculated from ProCost",null,null,null,"AG",null,"New batch spacing description for action 2",{"$nulls":4},"AV",null,"New site for Move action 4 within this stage ",null,null,null,"BK",null,"New ending week number if FSFS",{"$nulls":4},"BZ","Memory Area name or code (within site or environment type)",{"$nulls":72},"Search"]
["D","Starting week number",null,null,"S",null,"Week number of action 1",null,null,null,"AH",null,"New crop density for action 2",{"$nulls":4},"AW",null,"New area for Move action 4 within this stage ",null,null,null,"BL",null,"Memory Plant species and/or variety name",{"$nulls":4},"CA","Memory Entered stage-start date",{"$nulls":72},"Selection"]
["E","Estimated dispatch date (dd/mm/yyyy)",null,null,"T",null,"Production stage in which action was made",null,null,null,"AI",null,"New space (area) occupied by batch after action 2",{"$nulls":4},"AX",null,"New number of units for action 4",null,null,null,"BM",null,"Memory The type of starting plant material",{"$nulls":4},"CB","Memory Entered stage-end date",{"$nulls":72},"Actions"]
["F","Estimated dispatch week number",null,null,"U",null,"New site for Move action 1 within this stage ",null,null,null,"AJ",null,"New ending week number if FSFS",{"$nulls":4},"AY",null,"New batch spacing description for action 4",null,null,null,"BN",null,"Memory Starting date (dd/mm/yyyy)",{"$nulls":4},"CC","Memory Surplus or loss at Final stage for sale calculated from ProCost",{"$nulls":72},"Actions summary"]
["G","Unique code for this batch of plants",null,null,"V",null,"New area for Move action 1 within this stage ",null,null,null,"AK",null,"Week number of action 3",{"$nulls":4},"AZ",null,"New crop density for action 4",null,null,null,"BO",null,"Memory Starting week number",{"$nulls":78},"Unique code summary"]
["H","Sales or order number",null,null,"W",null,"New number of units for action 1",null,null,null,"AL",null,"Production stage in which action was made",{"$nulls":4},"BA",null,"New space (area) occupied by batch after action 4",null,null,null,"BP",null,"Memory Estimated dispatch date (dd/mm/yyyy)",{"$nulls":78},"Import data"]
["I","Unit number (plant number) for this batch",null,null,"X",null,"New batch spacing description for action 1",null,null,null,"AM",null,"New site for Move action 3 within this stage ",{"$nulls":4},"BB",null,"New ending week number if FSFS",null,null,null,"BQ",null,"Memory Estimated dispatch week number",{"$nulls":78},"Imported selection"]
["J","Container type",null,null,"Y",null,"New crop density for action 1",null,null,null,"AN",null,"New area for Move action 3 within this stage ",{"$nulls":4},"BC",null,"Week number of action 5",null,null,null,"BR",null,"Memory Unique code for this batch of plants",{"$nulls":78},"Space output"]
["K","Spacing description",null,null,"Z",null,"New space (area) occupied by batch after action 1",null,null,null,"AO",null,"New number of units for action 3",{"$nulls":4},"BD",null,"Production stage in which action was made",null,null,null,"BS",null,"Memory Sales or order number",{"$nulls":78},"Nursery summary report"]
["L","Crop density (plants per m2)",null,null,"AA",null,"New ending week number if FSFS",null,null,null,"AP",null,"New batch spacing description for action 3",{"$nulls":4},"BE",null,"New site for Move action 5 within this stage ",null,null,null,"BT",null,"Memory Unit number (plant number) for this batch",{"$nulls":78},"Stage 1"]
["M","Total area (m2)     ",null,null,"AB",null,"Week number of action 2",null,null,null,"AQ",null,"New crop density for action 3",{"$nulls":4},"BF",null,"New area for Move action 5 within this stage ",null,null,null,"BU",null,"Memory Container type",{"$nulls":78},"Final stage for sale"]
["N","Site or environment type",null,null,"AC",null,"Production stage in which action was made",null,null,null,"AR",null,"New space (area) occupied by batch after action 3",{"$nulls":4},"BG",null,"New number of units for action 5",null,null,null,"BV",null,"Memory Spacing description",{"$nulls":78},"Stage 2"]
["O","Area name or code (within site or environment type)",null,null,"AD",null,"New site for Move action 2 within this stage ",null,null,null,"AS",null,"New ending week number if FSFS",{"$nulls":4},"BH",null,"New batch spacing description for action 5",null,null,null,"BW",null,"Crop Memorydensity (plants per m2)",{"$nulls":78},"Stage 3"]
[{"$nulls":104},"Stage 4"]
[{"$nulls":18},19,20,21,22,23,24,25,26,27,28,29,30,31,32,33,34,35,36,37,38,39,40,41,42,43,44,45,46,47,48,49,50,51,52,53,54,55,56,57,58,59,60,61,62,63,64,65,66,67,68,69,70,71,72,73,74,75,76,77,78,79,80,81,{"$nulls":23},"Stage 5"]
[{"$nulls":18},"",{"$nulls":6},"",null,"",{"$nulls":6},"",null,"",{"$nulls":6},"",null,"",{"$nulls":6},"",null,"",{"$nulls":6},"",{"$nulls":42},"Stage 6"]
[{"$nulls":18},"",{"$nulls":6},"",{"$nulls":78},"Stage 7"]
[{"$nulls":104},"Stage 8"]
[{"$nulls":104},"Stage 9"]
[{"$nulls":18},"",{"$nulls":6},"",{"$nulls":78},"Menu"]
[{"$nulls":18},"",{"$nulls":6},"",{"$nulls":78},"User guide"]
[{"$nulls":104},"Contact us"]
[{"$nulls":104},"Nursery details"]

{"sheet":"Stage 7","index":17,"n_rows":29,"n_cols":105,"rows_kept":29,"cut":false,"hidden":false,"merged":[]}
[null,"Stage 7",{"$nulls":25}," ",{"$nulls":76},"DROP DOWN MENU PAGES"]
[{"$nulls":8},"Go to"]
[]
["Column letter","Data type",null,null,"Column letter",null,"Data type",null,null,null,"Column letter",null,"Data type",{"$nulls":4},"Column letter",null,"Data type",null,null,null,"Column letter",null,"Data type",{"$nulls":4},"Column letter","Data type",{"$nulls":72},"Production stage"]
["A","Plant species and/or variety name",null,null,"P",null,"Entered stage-start date",null,null,null,"AE",null,"New area for Move action 2 within this stage ",{"$nulls":4},"AT",null,"Week number of action 4",null,null,null,"BI",null,"New crop density for action 5",{"$nulls":4},"BX","Memory Total area (m2)     "]
["B","The type of starting plant material",null,null,"Q",null,"Entered stage-end date",null,null,null,"AF",null,"New number of units for action 2",{"$nulls":4},"AU",null,"Production stage in which action was made",null,null,null,"BJ",null,"New space (area) occupied by batch after action 5",{"$nulls":4},"BY","Memory Site or environment type",{"$nulls":72},"Data entry form"]
["C","Starting date (dd/mm/yyyy)",null,null,"R",null,"Surplus or loss at Final stage for sale calculated from ProCost",null,null,null,"AG",null,"New batch spacing description for action 2",{"$nulls":4},"AV",null,"New site for Move action 4 within this stage ",null,null,null,"BK",null,"New ending week number if FSFS",{"$nulls":4},"BZ","Memory Area name or code (within site or environment type)",{"$nulls":72},"Search"]
["D","Starting week number",null,null,"S",null,"Week number of action 1",null,null,null,"AH",null,"New crop density for action 2",{"$nulls":4},"AW",null,"New area for Move action 4 within this stage ",null,null,null,"BL",null,"Memory Plant species and/or variety name",{"$nulls":4},"CA","Memory Entered stage-start date",{"$nulls":72},"Selection"]
["E","Estimated dispatch date (dd/mm/yyyy)",null,null,"T",null,"Production stage in which action was made",null,null,null,"AI",null,"New space (area) occupied by batch after action 2",{"$nulls":4},"AX",null,"New number of units for action 4",null,null,null,"BM",null,"Memory The type of starting plant material",{"$nulls":4},"CB","Memory Entered stage-end date",{"$nulls":72},"Actions"]
["F","Estimated dispatch week number",null,null,"U",null,"New site for Move action 1 within this stage ",null,null,null,"AJ",null,"New ending week number if FSFS",{"$nulls":4},"AY",null,"New batch spacing description for action 4",null,null,null,"BN",null,"Memory Starting date (dd/mm/yyyy)",{"$nulls":4},"CC","Memory Surplus or loss at Final stage for sale calculated from ProCost",{"$nulls":72},"Actions summary"]
["G","Unique code for this batch of plants",null,null,"V",null,"New area for Move action 1 within this stage ",null,null,null,"AK",null,"Week number of action 3",{"$nulls":4},"AZ",null,"New crop density for action 4",null,null,null,"BO",null,"Memory Starting week number",{"$nulls":78},"Unique code summary"]
["H","Sales or order number",null,null,"W",null,"New number of units for action 1",null,null,null,"AL",null,"Production stage in which action was made",{"$nulls":4},"BA",null,"New space (area) occupied by batch after action 4",null,null,null,"BP",null,"Memory Estimated dispatch date (dd/mm/yyyy)",{"$nulls":78},"Import data"]
["I","Unit number (plant number) for this batch",null,null,"X",null,"New batch spacing description for action 1",null,null,null,"AM",null,"New site for Move action 3 within this stage ",{"$nulls":4},"BB",null,"New ending week number if FSFS",null,null,null,"BQ",null,"Memory Estimated dispatch week number",{"$nulls":78},"Imported selection"]
["J","Container type",null,null,"Y",null,"New crop density for action 1",null,null,null,"AN",null,"New area for Move action 3 within this stage ",{"$nulls":4},"BC",null,"Week number of action 5",null,null,null,"BR",null,"Memory Unique code for this batch of plants",{"$nulls":78},"Space output"]
["K","Spacing description",null,null,"Z",null,"New space (area) occupied by batch after action 1",null,null,null,"AO",null,"New number of units for action 3",{"$nulls":4},"BD",null,"Production stage in which action was made",null,null,null,"BS",null,"Memory Sales or order number",{"$nulls":78},"Nursery summary report"]
["L","Crop density (plants per m2)",null,null,"AA",null,"New ending week number if FSFS",null,null,null,"AP",null,"New batch spacing description for action 3",{"$nulls":4},"BE",null,"New site for Move action 5 within this stage ",null,null,null,"BT",null,"Memory Unit number (plant number) for this batch",{"$nulls":78},"Stage 1"]
["M","Total area (m2)     ",null,null,"AB",null,"Week number of action 2",null,null,null,"AQ",null,"New crop density for action 3",{"$nulls":4},"BF",null,"New area for Move action 5 within this stage ",null,null,null,"BU",null,"Memory Container type",{"$nulls":78},"Final stage for sale"]
["N","Site or environment type",null,null,"AC",null,"Production stage in which action was made",null,null,null,"AR",null,"New space (area) occupied by batch after action 3",{"$nulls":4},"BG",null,"New number of units for action 5",null,null,null,"BV",null,"Memory Spacing description",{"$nulls":78},"Stage 2"]
["O","Area name or code (within site or environment type)",null,null,"AD",null,"New site for Move action 2 within this stage ",null,null,null,"AS",null,"New ending week number if FSFS",{"$nulls":4},"BH",null,"New batch spacing description for action 5",null,null,null,"BW",null,"Crop Memorydensity (plants per m2)",{"$nulls":78},"Stage 3"]
[{"$nulls":104},"Stage 4"]
[{"$nulls":18},19,20,21,22,23,24,25,26,27,28,29,30,31,32,33,34,35,36,37,38,39,40,41,42,43,44,45,46,47,48,49,50,51,52,53,54,55,56,57,58,59,60,61,62,63,64,65,66,67,68,69,70,71,72,73,74,75,76,77,78,79,80,81,{"$nulls":23},"Stage 5"]
[{"$nulls":18},"",{"$nulls":6},"",null,"",{"$nulls":6},"",null,"",{"$nulls":6},"",null,"",{"$nulls":6},"",null,"",{"$nulls":6},"",{"$nulls":42},"Stage 6"]
[{"$nulls":18},"",{"$nulls":6},"",{"$nulls":78},"Stage 7"]
[{"$nulls":104},"Stage 8"]
[{"$nulls":104},"Stage 9"]
[{"$nulls":18},"",{"$nulls":6},"",{"$nulls":78},"Menu"]
[{"$nulls":18},"",{"$nulls":6},"",{"$nulls":78},"User guide"]
[{"$nulls":104},"Contact us"]
[{"$nulls":104},"Nursery details"]

{"sheet":"Stage 8","index":18,"n_rows":29,"n_cols":105,"rows_kept":29,"cut":false,"hidden":false,"merged":[]}
[null,"Stage 8",{"$nulls":25}," ",{"$nulls":76},"DROP DOWN MENU PAGES"]
[{"$nulls":8},"Go to"]
[]
["Column letter","Data type",null,null,"Column letter",null,"Data type",null,null,null,"Column letter",null,"Data type",{"$nulls":4},"Column letter",null,"Data type",null,null,null,"Column letter",null,"Data type",{"$nulls":4},"Column letter","Data type",{"$nulls":72},"Production stage"]
["A","Plant species and/or variety name",null,null,"P",null,"Entered stage-start date",null,null,null,"AE",null,"New area for Move action 2 within this stage ",{"$nulls":4},"AT",null,"Week number of action 4",null,null,null,"BI",null,"New crop density for action 5",{"$nulls":4},"BX","Memory Total area (m2)     "]
["B","The type of starting plant material",null,null,"Q",null,"Entered stage-end date",null,null,null,"AF",null,"New number of units for action 2",{"$nulls":4},"AU",null,"Production stage in which action was made",null,null,null,"BJ",null,"New space (area) occupied by batch after action 5",{"$nulls":4},"BY","Memory Site or environment type",{"$nulls":72},"Data entry form"]
["C","Starting date (dd/mm/yyyy)",null,null,"R",null,"Surplus or loss at Final stage for sale calculated from ProCost",null,null,null,"AG",null,"New batch spacing description for action 2",{"$nulls":4},"AV",null,"New site for Move action 4 within this stage ",null,null,null,"BK",null,"New ending week number if FSFS",{"$nulls":4},"BZ","Memory Area name or code (within site or environment type)",{"$nulls":72},"Search"]
["D","Starting week number",null,null,"S",null,"Week number of action 1",null,null,null,"AH",null,"New crop density for action 2",{"$nulls":4},"AW",null,"New area for Move action 4 within this stage ",null,null,null,"BL",null,"Memory Plant species and/or variety name",{"$nulls":4},"CA","Memory Entered stage-start date",{"$nulls":72},"Selection"]
["E","Estimated dispatch date (dd/mm/yyyy)",null,null,"T",null,"Production stage in which action was made",null,null,null,"AI",null,"New space (area) occupied by batch after action 2",{"$nulls":4},"AX",null,"New number of units for action 4",null,null,null,"BM",null,"Memory The type of starting plant material",{"$nulls":4},"CB","Memory Entered stage-end date",{"$nulls":72},"Actions"]
["F","Estimated dispatch week number",null,null,"U",null,"New site for Move action 1 within this stage ",null,null,null,"AJ",null,"New ending week number if FSFS",{"$nulls":4},"AY",null,"New batch spacing description for action 4",null,null,null,"BN",null,"Memory Starting date (dd/mm/yyyy)",{"$nulls":4},"CC","Memory Surplus or loss at Final stage for sale calculated from ProCost",{"$nulls":72},"Actions summary"]
["G","Unique code for this batch of plants",null,null,"V",null,"New area for Move action 1 within this stage ",null,null,null,"AK",null,"Week number of action 3",{"$nulls":4},"AZ",null,"New crop density for action 4",null,null,null,"BO",null,"Memory Starting week number",{"$nulls":78},"Unique code summary"]
["H","Sales or order number",null,null,"W",null,"New number of units for action 1",null,null,null,"AL",null,"Production stage in which action was made",{"$nulls":4},"BA",null,"New space (area) occupied by batch after action 4",null,null,null,"BP",null,"Memory Estimated dispatch date (dd/mm/yyyy)",{"$nulls":78},"Import data"]
["I","Unit number (plant number) for this batch",null,null,"X",null,"New batch spacing description for action 1",null,null,null,"AM",null,"New site for Move action 3 within this stage ",{"$nulls":4},"BB",null,"New ending week number if FSFS",null,null,null,"BQ",null,"Memory Estimated dispatch week number",{"$nulls":78},"Imported selection"]
["J","Container type",null,null,"Y",null,"New crop density for action 1",null,null,null,"AN",null,"New area for Move action 3 within this stage ",{"$nulls":4},"BC",null,"Week number of action 5",null,null,null,"BR",null,"Memory Unique code for this batch of plants",{"$nulls":78},"Space output"]
["K","Spacing description",null,null,"Z",null,"New space (area) occupied by batch after action 1",null,null,null,"AO",null,"New number of units for action 3",{"$nulls":4},"BD",null,"Production stage in which action was made",null,null,null,"BS",null,"Memory Sales or order number",{"$nulls":78},"Nursery summary report"]
["L","Crop density (plants per m2)",null,null,"AA",null,"New ending week number if FSFS",null,null,null,"AP",null,"New batch spacing description for action 3",{"$nulls":4},"BE",null,"New site for Move action 5 within this stage ",null,null,null,"BT",null,"Memory Unit number (plant number) for this batch",{"$nulls":78},"Stage 1"]
["M","Total area (m2)     ",null,null,"AB",null,"Week number of action 2",null,null,null,"AQ",null,"New crop density for action 3",{"$nulls":4},"BF",null,"New area for Move action 5 within this stage ",null,null,null,"BU",null,"Memory Container type",{"$nulls":78},"Final stage for sale"]
["N","Site or environment type",null,null,"AC",null,"Production stage in which action was made",null,null,null,"AR",null,"New space (area) occupied by batch after action 3",{"$nulls":4},"BG",null,"New number of units for action 5",null,null,null,"BV",null,"Memory Spacing description",{"$nulls":78},"Stage 2"]
["O","Area name or code (within site or environment type)",null,null,"AD",null,"New site for Move action 2 within this stage ",null,null,null,"AS",null,"New ending week number if FSFS",{"$nulls":4},"BH",null,"New batch spacing description for action 5",null,null,null,"BW",null,"Crop Memorydensity (plants per m2)",{"$nulls":78},"Stage 3"]
[{"$nulls":104},"Stage 4"]
[{"$nulls":18},19,20,21,22,23,24,25,26,27,28,29,30,31,32,33,34,35,36,37,38,39,40,41,42,43,44,45,46,47,48,49,50,51,52,53,54,55,56,57,58,59,60,61,62,63,64,65,66,67,68,69,70,71,72,73,74,75,76,77,78,79,80,81,{"$nulls":23},"Stage 5"]
[{"$nulls":18},"",{"$nulls":6},"",null,"",{"$nulls":6},"",null,"",{"$nulls":6},"",null,"",{"$nulls":6},"",null,"",{"$nulls":6},"",{"$nulls":42},"Stage 6"]
[{"$nulls":18},"",{"$nulls":6},"",{"$nulls":78},"Stage 7"]
[{"$nulls":104},"Stage 8"]
[{"$nulls":104},"Stage 9"]
[{"$nulls":18},"",{"$nulls":6},"",{"$nulls":78},"Menu"]
[{"$nulls":18},"",{"$nulls":6},"",{"$nulls":78},"User guide"]
[{"$nulls":104},"Contact us"]
[{"$nulls":104},"Nursery details"]

{"sheet":"Stage 9","index":19,"n_rows":29,"n_cols":105,"rows_kept":29,"cut":false,"hidden":false,"merged":[]}
[null,"Stage 9",{"$nulls":25}," ",{"$nulls":76},"DROP DOWN MENU PAGES"]
[{"$nulls":8},"Go to"]
[]
["Column letter","Data type",null,null,"Column letter",null,"Data type",null,null,null,"Column letter",null,"Data type",{"$nulls":4},"Column letter",null,"Data type",null,null,null,"Column letter",null,"Data type",{"$nulls":4},"Column letter","Data type",{"$nulls":72},"Production stage"]
["A","Plant species and/or variety name",null,null,"P",null,"Entered stage-start date",null,null,null,"AE",null,"New area for Move action 2 within this stage ",{"$nulls":4},"AT",null,"Week number of action 4",null,null,null,"BI",null,"New crop density for action 5",{"$nulls":4},"BX","Memory Total area (m2)     "]
["B","The type of starting plant material",null,null,"Q",null,"Entered stage-end date",null,null,null,"AF",null,"New number of units for action 2",{"$nulls":4},"AU",null,"Production stage in which action was made",null,null,null,"BJ",null,"New space (area) occupied by batch after action 5",{"$nulls":4},"BY","Memory Site or environment type",{"$nulls":72},"Data entry form"]
["C","Starting date (dd/mm/yyyy)",null,null,"R",null,"Surplus or loss at Final stage for sale calculated from ProCost",null,null,null,"AG",null,"New batch spacing description for action 2",{"$nulls":4},"AV",null,"New site for Move action 4 within this stage ",null,null,null,"BK",null,"New ending week number if FSFS",{"$nulls":4},"BZ","Memory Area name or code (within site or environment type)",{"$nulls":72},"Search"]
["D","Starting week number",null,null,"S",null,"Week number of action 1",null,null,null,"AH",null,"New crop density for action 2",{"$nulls":4},"AW",null,"New area for Move action 4 within this stage ",null,null,null,"BL",null,"Memory Plant species and/or variety name",{"$nulls":4},"CA","Memory Entered stage-start date",{"$nulls":72},"Selection"]
["E","Estimated dispatch date (dd/mm/yyyy)",null,null,"T",null,"Production stage in which action was made",null,null,null,"AI",null,"New space (area) occupied by batch after action 2",{"$nulls":4},"AX",null,"New number of units for action 4",null,null,null,"BM",null,"Memory The type of starting plant material",{"$nulls":4},"CB","Memory Entered stage-end date",{"$nulls":72},"Actions"]
["F","Estimated dispatch week number",null,null,"U",null,"New site for Move action 1 within this stage ",null,null,null,"AJ",null,"New ending week number if FSFS",{"$nulls":4},"AY",null,"New batch spacing description for action 4",null,null,null,"BN",null,"Memory Starting date (dd/mm/yyyy)",{"$nulls":4},"CC","Memory Surplus or loss at Final stage for sale calculated from ProCost",{"$nulls":72},"Actions summary"]
["G","Unique code for this batch of plants",null,null,"V",null,"New area for Move action 1 within this stage ",null,null,null,"AK",null,"Week number of action 3",{"$nulls":4},"AZ",null,"New crop density for action 4",null,null,null,"BO",null,"Memory Starting week number",{"$nulls":78},"Unique code summary"]
["H","Sales or order number",null,null,"W",null,"New number of units for action 1",null,null,null,"AL",null,"Production stage in which action was made",{"$nulls":4},"BA",null,"New space (area) occupied by batch after action 4",null,null,null,"BP",null,"Memory Estimated dispatch date (dd/mm/yyyy)",{"$nulls":78},"Import data"]
["I","Unit number (plant number) for this batch",null,null,"X",null,"New batch spacing description for action 1",null,null,null,"AM",null,"New site for Move action 3 within this stage ",{"$nulls":4},"BB",null,"New ending week number if FSFS",null,null,null,"BQ",null,"Memory Estimated dispatch week number",{"$nulls":78},"Imported selection"]
["J","Container type",null,null,"Y",null,"New crop density for action 1",null,null,null,"AN",null,"New area for Move action 3 within this stage ",{"$nulls":4},"BC",null,"Week number of action 5",null,null,null,"BR",null,"Memory Unique code for this batch of plants",{"$nulls":78},"Space output"]
["K","Spacing description",null,null,"Z",null,"New space (area) occupied by batch after action 1",null,null,null,"AO",null,"New number of units for action 3",{"$nulls":4},"BD",null,"Production stage in which action was made",null,null,null,"BS",null,"Memory Sales or order number",{"$nulls":78},"Nursery summary report"]
["L","Crop density (plants per m2)",null,null,"AA",null,"New ending week number if FSFS",null,null,null,"AP",null,"New batch spacing description for action 3",{"$nulls":4},"BE",null,"New site for Move action 5 within this stage ",null,null,null,"BT",null,"Memory Unit number (plant number) for this batch",{"$nulls":78},"Stage 1"]
["M","Total area (m2)     ",null,null,"AB",null,"Week number of action 2",null,null,null,"AQ",null,"New crop density for action 3",{"$nulls":4},"BF",null,"New area for Move action 5 within this stage ",null,null,null,"BU",null,"Memory Container type",{"$nulls":78},"Final stage for sale"]
["N","Site or environment type",null,null,"AC",null,"Production stage in which action was made",null,null,null,"AR",null,"New space (area) occupied by batch after action 3",{"$nulls":4},"BG",null,"New number of units for action 5",null,null,null,"BV",null,"Memory Spacing description",{"$nulls":78},"Stage 2"]
["O","Area name or code (within site or environment type)",null,null,"AD",null,"New site for Move action 2 within this stage ",null,null,null,"AS",null,"New ending week number if FSFS",{"$nulls":4},"BH",null,"New batch spacing description for action 5",null,null,null,"BW",null,"Crop Memorydensity (plants per m2)",{"$nulls":78},"Stage 3"]
[{"$nulls":104},"Stage 4"]
[{"$nulls":18},19,20,21,22,23,24,25,26,27,28,29,30,31,32,33,34,35,36,37,38,39,40,41,42,43,44,45,46,47,48,49,50,51,52,53,54,55,56,57,58,59,60,61,62,63,64,65,66,67,68,69,70,71,72,73,74,75,76,77,78,79,80,81,{"$nulls":23},"Stage 5"]
[{"$nulls":18},"",{"$nulls":6},"",null,"",{"$nulls":6},"",null,"",{"$nulls":6},"",null,"",{"$nulls":6},"",null,"",{"$nulls":6},"",{"$nulls":42},"Stage 6"]
[{"$nulls":18},"",{"$nulls":6},"",{"$nulls":78},"Stage 7"]
[{"$nulls":104},"Stage 8"]
[{"$nulls":104},"Stage 9"]
[{"$nulls":18},"",{"$nulls":6},"",{"$nulls":78},"Menu"]
[{"$nulls":18},"",{"$nulls":6},"",{"$nulls":78},"User guide"]
[{"$nulls":104},"Contact us"]
[{"$nulls":104},"Nursery details"]

{"sheet":"Final stage for sale","index":20,"n_rows":29,"n_cols":105,"rows_kept":29,"cut":false,"hidden":false,"merged":[]}
[null,"Final stage for sale",{"$nulls":25}," ",{"$nulls":76},"DROP DOWN MENU PAGES"]
[{"$nulls":8},"Go to"]
[]
["Column letter","Data type",null,null,"Column letter",null,"Data type",null,null,null,"Column letter",null,"Data type",{"$nulls":4},"Column letter",null,"Data type",null,null,null,"Column letter",null,"Data type",{"$nulls":4},"Column letter","Data type",{"$nulls":72},"Production stage"]
["A","Plant species and/or variety name",null,null,"P",null,"Entered stage-start date",null,null,null,"AE",null,"New area for Move action 2 within this stage ",{"$nulls":4},"AT",null,"Week number of action 4",null,null,null,"BI",null,"New crop density for action 5",{"$nulls":4},"BX","Memory Total area (m2)     "]
["B","The type of starting plant material",null,null,"Q",null,"Entered stage-end date",null,null,null,"AF",null,"New number of units for action 2",{"$nulls":4},"AU",null,"Production stage in which action was made",null,null,null,"BJ",null,"New space (area) occupied by batch after action 5",{"$nulls":4},"BY","Memory Site or environment type",{"$nulls":72},"Data entry form"]
["C","Starting date (dd/mm/yyyy)",null,null,"R",null,"Surplus or loss at Final stage for sale calculated from ProCost",null,null,null,"AG",null,"New batch spacing description for action 2",{"$nulls":4},"AV",null,"New site for Move action 4 within this stage ",null,null,null,"BK",null,"New ending week number if FSFS",{"$nulls":4},"BZ","Memory Area name or code (within site or environment type)",{"$nulls":72},"Search"]
["D","Starting week number",null,null,"S",null,"Week number of action 1",null,null,null,"AH",null,"New crop density for action 2",{"$nulls":4},"AW",null,"New area for Move action 4 within this stage ",null,null,null,"BL",null,"Memory Plant species and/or variety name",{"$nulls":4},"CA","Memory Entered stage-start date",{"$nulls":72},"Selection"]
["E","Estimated dispatch date (dd/mm/yyyy)",null,null,"T",null,"Production stage in which action was made",null,null,null,"AI",null,"New space (area) occupied by batch after action 2",{"$nulls":4},"AX",null,"New number of units for action 4",null,null,null,"BM",null,"Memory The type of starting plant material",{"$nulls":4},"CB","Memory Entered stage-end date",{"$nulls":72},"Actions"]
["F","Estimated dispatch week number",null,null,"U",null,"New site for Move action 1 within this stage ",null,null,null,"AJ",null,"New ending week number if FSFS",{"$nulls":4},"AY",null,"New batch spacing description for action 4",null,null,null,"BN",null,"Memory Starting date (dd/mm/yyyy)",{"$nulls":4},"CC","Memory Surplus or loss at Final stage for sale calculated from ProCost",{"$nulls":72},"Actions summary"]
["G","Unique code for this batch of plants",null,null,"V",null,"New area for Move action 1 within this stage ",null,null,null,"AK",null,"Week number of action 3",{"$nulls":4},"AZ",null,"New crop density for action 4",null,null,null,"BO",null,"Memory Starting week number",{"$nulls":78},"Unique code summary"]
["H","Sales or order number",null,null,"W",null,"New number of units for action 1",null,null,null,"AL",null,"Production stage in which action was made",{"$nulls":4},"BA",null,"New space (area) occupied by batch after action 4",null,null,null,"BP",null,"Memory Estimated dispatch date (dd/mm/yyyy)",{"$nulls":78},"Import data"]
["I","Unit number (plant number) for this batch",null,null,"X",null,"New batch spacing description for action 1",null,null,null,"AM",null,"New site for Move action 3 within this stage ",{"$nulls":4},"BB",null,"New ending week number if FSFS",null,null,null,"BQ",null,"Memory Estimated dispatch week number",{"$nulls":78},"Imported selection"]
["J","Container type",null,null,"Y",null,"New crop density for action 1",null,null,null,"AN",null,"New area for Move action 3 within this stage ",{"$nulls":4},"BC",null,"Week number of action 5",null,null,null,"BR",null,"Memory Unique code for this batch of plants",{"$nulls":78},"Space output"]
["K","Spacing description",null,null,"Z",null,"New space (area) occupied by batch after action 1",null,null,null,"AO",null,"New number of units for action 3",{"$nulls":4},"BD",null,"Production stage in which action was made",null,null,null,"BS",null,"Memory Sales or order number",{"$nulls":78},"Nursery summary report"]
["L","Crop density (plants per m2)",null,null,"AA",null,"New ending week number if FSFS",null,null,null,"AP",null,"New batch spacing description for action 3",{"$nulls":4},"BE",null,"New site for Move action 5 within this stage ",null,null,null,"BT",null,"Memory Unit number (plant number) for this batch",{"$nulls":78},"Stage 1"]
["M","Total area (m2)     ",null,null,"AB",null,"Week number of action 2",null,null,null,"AQ",null,"New crop density for action 3",{"$nulls":4},"BF",null,"New area for Move action 5 within this stage ",null,null,null,"BU",null,"Memory Container type",{"$nulls":78},"Final stage for sale"]
["N","Site or environment type",null,null,"AC",null,"Production stage in which action was made",null,null,null,"AR",null,"New space (area) occupied by batch after action 3",{"$nulls":4},"BG",null,"New number of units for action 5",null,null,null,"BV",null,"Memory Spacing description",{"$nulls":78},"Stage 2"]
["O","Area name or code (within site or environment type)",null,null,"AD",null,"New site for Move action 2 within this stage ",null,null,null,"AS",null,"New ending week number if FSFS",{"$nulls":4},"BH",null,"New batch spacing description for action 5",null,null,null,"BW",null,"Crop Memorydensity (plants per m2)",{"$nulls":78},"Stage 3"]
[{"$nulls":104},"Stage 4"]
[{"$nulls":18},19,20,21,22,23,24,25,26,27,28,29,30,31,32,33,34,35,36,37,38,39,40,41,42,43,44,45,46,47,48,49,50,51,52,53,54,55,56,57,58,59,60,61,62,63,64,65,66,67,68,69,70,71,72,73,74,75,76,77,78,79,80,81,{"$nulls":23},"Stage 5"]
[{"$nulls":104},"Stage 6"]
[{"$nulls":104},"Stage 7"]
[{"$nulls":104},"Stage 8"]
[{"$nulls":104},"Stage 9"]
[{"$nulls":104},"Menu"]
[{"$nulls":104},"User guide"]
[{"$nulls":104},"Contact us"]
[{"$nulls":104},"Nursery details"]

{"sheet":"User guide","index":21,"n_rows":29,"n_cols":104,"rows_kept":29,"cut":false,"hidden":false,"merged":[[21,1,21,9],[22,1,22,9],[23,1,23,9],[24,1,24,9],[31,1,31,9],[25,1,25,9],[26,1,26,9],[27,1,27,9],[30,1,30,9],[16,1,16,9],[18,1,18,9],[19,1,19,9],[20,1,20,9],[12,1,12,9],[13,1,13,9],[14,1,14,9],[15,1,15,9]]}
[{"$nulls":103},"DROP DOWN MENU PAGES"]
[{"$nulls":4},"User Guide"]
[]
[{"$nulls":5},"Go to",{"$nulls":97},"Production stage"]
[]
[{"$nulls":103},"Data entry form"]
[{"$nulls":103},"Search"]
[{"$nulls":103},"Selection"]
[{"$nulls":103},"Actions"]
[{"$nulls":103},"Actions summary"]
[{"$nulls":103},"Unique code summary"]
[{"$nulls":103},"Import data"]
[{"$nulls":103},"Imported selection"]
[{"$nulls":103},"Space output"]
[{"$nulls":103},"Nursery summary report"]
[{"$nulls":103},"Stage 1"]
[{"$nulls":103},"Final stage for sale"]
[{"$nulls":103},"Stage 2"]
[{"$nulls":103},"Stage 3"]
[{"$nulls":103},"Stage 4"]
[{"$nulls":103},"Stage 5"]
[{"$nulls":103},"Stage 6"]
[{"$nulls":103},"Stage 7"]
[{"$nulls":103},"Stage 8"]
[{"$nulls":103},"Stage 9"]
[{"$nulls":103},"Menu"]
[{"$nulls":103},"User guide"]
[{"$nulls":103},"Contact us"]
[{"$nulls":103},"Nursery details"]

{"sheet":"Nursery details","index":22,"n_rows":29,"n_cols":104,"rows_kept":29,"cut":false,"hidden":false,"merged":[[12,3,12,5],[7,3,7,5],[8,3,8,5],[11,3,11,5],[9,3,9,5],[10,3,10,5],[13,3,13,5],[14,3,14,5],[15,3,15,5],[16,3,16,5],[17,3,17,5]]}
[{"$nulls":103},"DROP DOWN MENU PAGES"]
[]
[null,null,null,"       Go to"]
[{"$nulls":103},"Production stage"]
[]
[null,"Nursery details",{"$nulls":101},"Data entry form"]
[{"$nulls":103},"Search"]
[null,"Nursery's name",{"$nulls":101},"Selection"]
[null,"Division's name",{"$nulls":101},"Actions"]
[{"$nulls":103},"Actions summary"]
[null,"Address:",{"$nulls":101},"Unique code summary"]
[null,"Road name",{"$nulls":101},"Import data"]
[null,"Town",{"$nulls":101},"Imported selection"]
[null,"County",{"$nulls":101},"Space output"]
[null,"Post code",{"$nulls":101},"Nursery summary report"]
[null,"Phone number",{"$nulls":101},"Stage 1"]
[null,"Fax number",{"$nulls":101},"Final stage for sale"]
[null,"Email",{"$nulls":101},"Stage 2"]
[{"$nulls":103},"Stage 3"]
[{"$nulls":103},"Stage 4"]
[{"$nulls":103},"Stage 5"]
[{"$nulls":103},"Stage 6"]
[{"$nulls":103},"Stage 7"]
[{"$nulls":103},"Stage 8"]
[{"$nulls":103},"Stage 9"]
[{"$nulls":103},"Menu"]
[{"$nulls":103},"User guide"]
[{"$nulls":103},"Contact us"]
[{"$nulls":103},"Nursery details"]

{"sheet":"Contact us","index":23,"n_rows":29,"n_cols":100,"rows_kept":29,"cut":false,"hidden":false,"merged":[[22,7,22,9],[22,3,22,5],[21,7,21,9],[6,11,6,13],[7,11,7,13],[20,7,20,9],[6,3,6,5],[7,3,7,5],[6,7,6,9],[7,7,7,9]]}
[{"$nulls":99},"DROP DOWN MENU PAGES"]
[{"$nulls":5},"               Contact us"]
[{"$nulls":10},"    Go to"]
[{"$nulls":99},"Production stage"]
[null,"The project team"]
[{"$nulls":99},"Data entry form"]
[null,"Name:",null,"Professor John Colvin",null,null,null,"Mr W George",null,null,null,"Ms Louise Arculus",{"$nulls":87},"Search"]
[{"$nulls":99},"Selection"]
[null,"Institute / Company:",null,"Natural Resources Institute",null,null,null,"ADAS Boxworth",null,null,null,"HDC",{"$nulls":87},"Actions"]
[null,null,null,"University of Greenwich",null,null,null,"Boxworth",null,null,null,"AHDB",{"$nulls":87},"Actions summary"]
[null,"Post code:",null,"ME4 4TB",null,null,null,"CB23 4NN",{"$nulls":91},"Unique code summary"]
[null,"Phone number:",null,"01634-883310",null,null,null,"01403 823275",null,null,null,"0247-647-8661",{"$nulls":87},"Import data"]
[null,"Fax number:",null,"01634-883378",{"$nulls":95},"Imported selection"]
[null,"Email:",null,"j.colvin@greenwich@ac.uk",null,null,null,"will.george@adas.co.uk",null,null,null,"louise.arculus@hdc.ahdb.org.uk",{"$nulls":87},"Space output"]
[{"$nulls":99},"Nursery summary report"]
[{"$nulls":99},"Stage 1"]
[null,null,null,"Industry representatives on the AHDB-funded research project HNS 136",{"$nulls":95},"Final stage for sale"]
[{"$nulls":99},"Stage 2"]
[null,null,null,"Names:",null,null,null,"Company:",null,null,null,"Email address:",{"$nulls":87},"Stage 3"]
[{"$nulls":99},"Stage 4"]
[null,null,null,"Mr Chris Bowman",null,null,null,"John Woods Nurseries Ltd.",null,null,null,"cbowman@johnwoodsnurseries.co.uk",{"$nulls":87},"Stage 5"]
[null,null,null,"Dr Steve Carter",null,null,null,"Fleurie Nursery Ltd & Star Plants Ltd.",null,null,null,"steve.carter@fleurienursery.co.uk",{"$nulls":87},"Stage 6"]
[null,null,null,"Dr Bill Godfrey",null,null,null,"Hook Mill Nursery Ltd.",null,null,null,"bill-godfrey@btconnect.com",{"$nulls":87},"Stage 7"]
[null,null,null,"Mr Dave Hooker",null,null,null,"Hillier Nurseries Ltd.",null,null,null,"Dave_Hooker@hillier.co.uk",{"$nulls":87},"Stage 8"]
[null,null,null,"Mr John Richards",null,null,null,"John Richards' Nurseries Ltd.",null,null,null,"john@john-richards-nurseries.co.uk",{"$nulls":87},"Stage 9"]
[{"$nulls":99},"Menu"]
[{"$nulls":99},"User guide"]
[{"$nulls":99},"Contact us"]
[{"$nulls":99},"Nursery details"]